{"text_format":"1","workbook":"xlsx","n_sheets":9,"sheets":["About PermPave HyPerMod","PermPave HyPerMod","All_Simulations_PP","All_Graphs","Soil Group A","Soil Group B","Soil Group C","Soil Group D (avg.)","Soil Group D (extreme)"],"not_rendered":{"charts":45,"images":5,"macros":1,"external_links":0,"defined_names":16,"comments":1,"pivot_tables":0},"unopened":[],"bounds":{"document_bytes":16777216,"sheet_cells":100000,"rows_first":2000,"rows_last":500,"rows_between":2000,"halvings":0,"cell_chars":16384,"cell_head_chars":4096},"cells_cut":0,"cells_raw":0,"read":"whole","date_system":"1900"}

{"sheet":"About PermPave HyPerMod","index":0,"n_rows":70,"n_cols":10,"rows_kept":70,"cut":false,"hidden":false,"merged":[[20,1,20,7],[29,1,29,7],[37,1,37,7],[2,0,2,8],[8,0,8,8],[11,1,18,7],[30,1,35,7],[10,1,10,7],[3,1,3,7],[5,1,5,7],[6,1,6,7],[7,1,7,7],[4,1,4,7],[72,1,72,7],[73,1,73,7],[69,1,71,7],[26,9,26,10],[21,1,27,7],[47,1,49,7],[61,1,63,7],[65,1,67,7],[51,1,51,7],[52,1,54,7],[56,1,56,7],[57,1,59,7],[39,1,41,7],[43,1,45,7]]}
["North Carolina Long-Term Permeable Pavement Hydrologic Performance Model"]
[]
["LONG-TERM MODELING OF BIORETENTION HYDROLOGY WITH DRAINMOD"]
[null,"Developed by: Drs. Alessandra P. Smolek and William F. Hunt"]
[null,"User Interface by: Brad J. Wardynski and Alessandra Smolek"]
[null,"Department of Biological and Agricultural Engineering"]
[null,"North Carolina State University, Raleigh, North Carolina"]
[null,"Contact: Dr. William (Bill) F. Hunt, 919-515-6715, bill_hunt@ncsu.edu"]
[]
[]
[null,"INTRODUCTION"]
[null,"Previous permerable pavement design standards in North Carolina relied upon capture and treatment of a specific water quality volume.  This \"one size fits all\" approach, while conservative, does not allow designers and regulators to assess the average annual performance of permeable pavements with varying design features.  DRAINMOD allows for accurate long-term prediction of permeable pavement hydrology by simulating drainage system designs under complex saturated and unsaturated conditions using real weather data. Output from DRAINMOD simulations of various permeable pavement designs for the state of North Carolina are provided in this model."]
[]
[]
[]
[]
[]
[]
[]
[]
{"$rows_left_out":51}
{"sheet":"PermPave HyPerMod","index":1,"n_rows":49,"n_cols":13,"rows_kept":49,"cut":false,"hidden":false,"merged":[[44,5,44,11],[48,5,50,11],[27,2,28,2],[18,2,19,2],[33,0,33,11],[34,0,43,11],[47,5,47,10],[2,12,43,14],[4,2,4,3],[5,2,5,3],[6,2,6,3],[10,2,10,3],[12,2,12,3]]}
["North Carolina Long-Term Permeable Pavement Hydrologic Performance Model"]
["DESIGN INPUT PARAMETERS",null,null,null,null,null,null,null,null,null,null,null,"NOTES"]
["Units","English"]
["Hydrologic Soil Group","A"]
["Profile Depth (Pavement + Aggregate)",18,{"$f":"IF(B3=\"SI\",IF(OR(B5=23,B5=30,B5=45,B5=60,B5=90),\"cm\",\"PLEASE UPDATE!\"),IF(B3=\"ENGLISH\",IF(OR(B5=9,B5=12,B5=18,B5=24,B5=36),\"in\",\"PLEASE UPDATE!\")))","v":"in"}]
["Depth of IWS",6,{"$f":"IF(AND(B3=\"SI\",OR(B5=23,B5=30),OR(B6=7.5,B6=15,B6=30,B6=45)),\"PLEASE UPDATE!\",IF(AND(B3=\"English\",OR(B5=9,B5=12),OR(B6=3,B6=6,B6=12,B6=18)),\"PLEASE UPDATE!\",IF(B3=\"SI\",IF(OR(B6=\"NO IWS\",B6=7.5,B6=15,B6=30,B6=45),\"cm\",\"PLEASE UPDATE!\"),IF(B3=\"ENGLISH\",IF(OR(B6=\"NO IWS\",B6=3,B6=6,B6=12,B6=18),\"in\",\"PLEASE UPDATE!\")))))","v":"in"}]
["Run-on Ratio",1]
["Factor of Safety","NONE"]
[]
["WATER QUALITY CHARACTERIZATION"]
["Runoff Avg TN Conc.",1.63,"mg/L"]
["Drainage Avg TN Conc.",1.1100000000000001,"mg/L"]
["Runoff Avg TP Conc.",0.19,"mg/L"]
["Drainage Avg TP Conc.",0.05,"mg/L"]
[]
["DESIGN OUTPUT PARAMETERS"]
["Maximum Subgrade Ksat",{"$f":"IF(B3=\"SI\",HLOOKUP(B4,All_Simulations_PP!B1:F2,2),HLOOKUP(B4,All_Simulations_PP!B1:F3,3))","v":1.18},{"$f":"IF(B3=\"SI\",\"cm/hr\",\"in/hr\")","v":"in/hr"}]
[]
["HYDROLOGY",{"$f":"IF(B3=\"SI\",\"Total (cm/yr)\",\"Total (in/yr)\")","v":"Total (in/yr)"},"Percent \nof Total"]
["Total Inflow (Rainfall + Runoff)",{"$f":"IF(B3=\"SI\",INDEX(RAINFALLSI,MATCH(B4&B5&B6&B7,SOILGROUP&PROFILEDEPTHSI&IWS&RUNON,0)),INDEX(RAINFALLSI,MATCH(B4&B5&B6&B7,SOILGROUP&PROFILEDEPTH&IWSENG&RUNON,0))/2.54)","v":71.055118110236222}]
{"$rows_left_out":30}
{"sheet":"All_Simulations_PP","index":2,"n_rows":361,"n_cols":20,"rows_kept":361,"cut":false,"hidden":true,"merged":[[0,7,0,11]]}
["Soil Type","A","B","C","D (avg.)","D (extreme)",null,"Variable Selection Lists"]
["Ksat (cm/hr)",3,0.35,0.05,0.02,5.0000000000000001E-3,null,"Factors of Safety","Units","Profile Depth","Run-on Ratio","Depth of IWS"]
["Ksat (in/hr)",{"$f":"ROUND(B2/2.54,2)","v":1.18},{"$f":"ROUND(C2/2.54,2)","v":0.14000000000000001},{"$f":"(ROUND(D2/2.54,3))","v":0.02},{"$f":"E2/2.54","v":7.874015748031496E-3},{"$f":"ROUND(F2/2.54,4)","v":2E-3},null,"Safety","Units","Profile Depth","Run-on Ratio","IWS"]
[null,null,null,null,null,null,null,"NONE","SI",{"$f":"IF('PermPave HyPerMod'!B3=\"SI\",23,9)","v":9},0,"NO IWS"]
[null,null,null,null,null,null,null,0.1,"English",{"$f":"IF('PermPave HyPerMod'!B3=\"SI\",30,12)","v":12},0.5,{"$f":"IF(OR('PermPave HyPerMod'!B5=23,'PermPave HyPerMod'!B5=30,'PermPave HyPerMod'!B5=9,'PermPave HyPerMod'!B5=12),\"\",IF('PermPave HyPerMod'!B3=\"SI\",7.5,3))","v":3}]
[null,null,null,null,null,null,null,null,null,{"$f":"IF('PermPave HyPerMod'!B3=\"SI\",45,18)","v":18},1,{"$f":"IF(OR('PermPave HyPerMod'!B5=23,'PermPave HyPerMod'!B5=30,'PermPave HyPerMod'!B5=9,'PermPave HyPerMod'!B5=12),\"\",IF('PermPave HyPerMod'!B3=\"SI\",15,6))","v":6}]
[null,null,null,null,null,null,null,null,null,{"$f":"IF('PermPave HyPerMod'!B3=\"SI\",60,24)","v":24},2,{"$f":"IF(OR('PermPave HyPerMod'!B5=23,'PermPave HyPerMod'!B5=30,'PermPave HyPerMod'!B5=45,'PermPave HyPerMod'!B5=9,'PermPave HyPerMod'!B5=12,'PermPave HyPerMod'!B5=18),\"\",IF('PermPave HyPerMod'!B3=\"SI\",30,12))","v":""}]
[null,null,null,null,null,null,null,null,null,{"$f":"IF('PermPave HyPerMod'!B3=\"SI\",90,36)","v":36},4,{"$f":"IF('PermPave HyPerMod'!B3=\"SI\",IF('PermPave HyPerMod'!B5=90,45,\"\"),IF('PermPave HyPerMod'!B3=\"English\",IF('PermPave HyPerMod'!B5=36,18,\"\")))","v":""}]
[]
["A,B,C, or D","9,12,18,24 or 36 in","23, 30, 45, 60 or 90 cm","3, 6, 12, 18 in.","7.5, 15, 30, 45 cm"]
["Soil Type","Profile Depth","Profile Depth","Depth of IWS","Depth of IWS","Run-on Ratio","% Drainage","% Runoff","% Evap","% Exfiltration","% Evap + Exf","Rainfall","Evap","Drainage","Runoff","Exfil","EvapExfil","EvapExfil10","Runoff10","Drainage10"]
["A",9,23,"NO IWS","NO IWS",0,{"$f":"N12/L12*100","v":16.833863469537555},{"$f":"O12/L12*100","v":0.81559416034581189},{"$f":"M12/L12*100","v":23.456488051545549},{"$f":"100-G12-H12-I12","v":58.894054318571079},{"$f":"I12+J12","v":82.350542370116628},108.14000000000001,25.365846178941361,18.204139955957913,0.88198352499796107,63.688030340102763,{"$f":"M12+P12","v":89.053876519044124},{"$f":"Q12*0.9","v":80.148488867139719},{"$f":"O12*1.1","v":0.97018187749775731},{"$f":"L12-(R12+S12)","v":27.021329255362545}]
["A",12,30,"NO IWS","NO IWS",0,17.103009542451673,0.23652230650028544,23.44833210994209,59.21213604110595,{"$f":"I13+J13","v":82.660468151048036},108.14000000000001,25.357026343691381,18.495194519207242,0.25577522224940868,64.032003914851956,{"$f":"M13+P13","v":89.389030258543329},{"$f":"Q13*0.9","v":80.450127232688999},{"$f":"O13*1.1","v":0.2813527444743496},{"$f":"L13-(R13+S13)","v":27.408520022836669}]
["A",18,45,"NO IWS","NO IWS",0,16.988826360003259,0,23.44833210994209,59.562841530054655,83.011173639996741,108.14000000000001,25.357026343691381,18.371716825707527,0,64.41125683060109,89.768283174292463,80.791454856863226,0,27.348545143136789]
["A",18,45,3,7.5,0,8.6860778076828957,0,23.44833210994209,67.865590082375022,91.313922192317108,108.14000000000001,25.357026343691381,9.3931245412282856,0,73.389849115080324,98.746875458771711,88.872187912894546,0,19.267812087105469]
["A",18,45,6,15,0,2.8301117363999673,0,23.44833210994209,73.721556153657943,97.169888263600029,108.14000000000001,25.357026343691381,3.0604828317429251,0,79.722490824565696,105.07951716825707,94.571565451431368,0,13.568434548568646]
["A",24,60,"NO IWS","NO IWS",0,16.89911100236522,0,23.44833210994209,59.652556887692697,83.100888997634783,108.14000000000001,25.357026343691381,18.274698637957755,0,64.508275018350872,89.86530136204226,80.878771225838037,0,27.261228774161978]
["A",24,60,3,7.5,0,6.6634042900252819,0,23.44833210994209,69.88826360003263,93.336595709974716,108.14000000000001,25.357026343691381,7.2058053992333413,0,75.577168257075272,100.93419460076666,90.840775140689999,0,17.299224859310016]
["A",24,60,6,15,0,2.7730201451757601,0,23.44833210994209,73.77864774488215,97.226979854824236,108.14000000000001,25.357026343691381,2.9987439849930673,0,79.784229671315558,105.14125601500695,94.627130413506251,0,13.512869586493764]
["A",24,60,12,30,0,0.45673272979365465,0,23.44833210994209,76.094935160264257,99.543267270206343,108.14000000000001,25.357026343691381,0.49391077399885824,0,82.289062882309764,107.64608922600115,96.881480303401034,0,11.258519696598981]
{"$rows_left_out":342}
{"sheet":"All_Graphs","index":3,"n_rows":0,"n_cols":0,"rows_kept":0,"cut":false,"hidden":true,"merged":[]}

{"sheet":"Soil Group A","index":4,"n_rows":72,"n_cols":11,"rows_kept":72,"cut":false,"hidden":true,"merged":[]}
[]
["Soil Type","Profile Depth","Profile Depth","Depth of IWS","Depth of IWS","Run-on Ratio","% Drainage","% Runoff","% Evap","% Exfiltration","% Evap + Exf"]
["A",9,23,"NO IWS","NO IWS",0,16.833863469537555,0.81559416034581189,23.456488051545549,58.894054318571079,82.350542370116628]
["A",12,30,"NO IWS","NO IWS",0,17.103009542451673,0.23652230650028544,23.44833210994209,59.21213604110595,82.660468151048036]
["A",18,45,"NO IWS","NO IWS",0,16.988826360003259,0,23.44833210994209,59.562841530054655,83.011173639996741]
["A",18,45,3,7.5,0,8.6860778076828957,0,23.44833210994209,67.865590082375022,91.313922192317108]
["A",18,45,6,15,0,2.8301117363999673,0,23.44833210994209,73.721556153657943,97.169888263600029]
["A",24,60,"NO IWS","NO IWS",0,16.89911100236522,0,23.44833210994209,59.652556887692697,83.100888997634783]
["A",24,60,3,7.5,0,6.6634042900252819,0,23.44833210994209,69.88826360003263,93.336595709974716]
["A",24,60,6,15,0,2.7730201451757601,0,23.44833210994209,73.77864774488215,97.226979854824236]
["A",24,60,12,30,0,0.45673272979365465,0,23.44833210994209,76.094935160264257,99.543267270206343]
["A",36,90,"NO IWS","NO IWS",0,16.996982301606717,0,23.44833210994209,59.554685588451193,83.003017698393279]
["A",36,90,3,7.5,0,8.6942337492863544,0,23.44833210994209,67.857434140771559,91.305766250713646]
["A",36,90,6,15,0,2.8382676780034251,0,23.44833210994209,73.713400212054495,97.161732321996581]
["A",36,90,12,30,0,0.52198026262131969,0,23.44833210994209,76.029687627436587,99.478019737378673]
["A",36,90,18,45,0,3.2623766413832481E-2,0,23.44833210994209,76.519044123644079,99.967376233586165]
["A",9,23,"NO IWS","NO IWS",0.5,20.830157300256392,1.5730025639248839,19.929318827524082,57.667521308294639,77.596840135818724]
["A",12,30,"NO IWS","NO IWS",0.5,21.238999376342594,0.6929526713325479,19.922389300810757,58.145658651514104,78.068047952324861]
["A",18,45,"NO IWS","NO IWS",0.5,21.259787956482569,4.8506686993278363E-2,19.922389300810757,58.769316055713396,78.691705356524153]
["A",18,45,3,7.5,0.5,12.237544175732799,4.8506686993278363E-2,19.922389300810757,67.791559836463165,87.713949137273914]
{"$rows_left_out":53}
{"sheet":"Soil Group B","index":5,"n_rows":72,"n_cols":11,"rows_kept":72,"cut":false,"hidden":true,"merged":[]}
[]
["Soil Type","Profile Depth","Profile Depth","Depth of IWS","Depth of IWS","Run-on Ratio","% Drainage","% Runoff","% Evap","% Exfiltration","% Evap + Exf"]
["B",9,23,"NO IWS","NO IWS",0,55.770328684446611,1.3865100725878801,23.472799934752466,19.370361308213042,42.843161242965508]
["B",12,30,"NO IWS","NO IWS",0,56.455427779137089,0.62800750346627521,23.44833210994209,19.468232607454542,42.916564717396632]
["B",18,45,"NO IWS","NO IWS",0,56.700106027240835,2.446782481037435E-2,23.44833210994209,19.827094038006702,43.275426147948792]
["B",18,45,3,7.5,0,35.731180164750022,4.89356496207487E-2,23.44833210994209,40.771552075687154,64.21988418562924]
["B",18,45,6,15,0,17.086697659244756,5.7091591224206831E-2,23.44833210994209,59.407878639588958,82.856210749531044]
["B",24,60,"NO IWS","NO IWS",0,56.618546611206256,0,23.44833210994209,19.933121278851655,43.381453388793744]
["B",24,60,3,7.5,0,35.608841040698138,0,23.44833210994209,40.942826849359776,64.391158959301862]
["B",24,60,6,15,0,16.874643177554844,0,23.44833210994209,59.677024712503069,83.125356822445156]
["B",24,60,12,30,0,3.0911018677106266,0,23.44833210994209,73.460566022347294,96.90889813228938]
["B",36,90,"NO IWS","NO IWS",0,56.797977326482339,0,23.44833210994209,19.753690563575571,43.202022673517661]
["B",36,90,3,7.5,0,35.755647989560394,0,23.44833210994209,40.796019900497512,64.244352010439599]
["B",36,90,6,15,0,16.996982301606717,0,23.44833210994209,59.554685588451193,83.003017698393279]
["B",36,90,12,30,0,3.1400375173313755,0,23.44833210994209,73.411630372726535,96.859962482668621]
["B",36,90,18,45,0,0.84821792675964447,0,23.44833210994209,75.703449963298269,99.151782073240355]
["B",9,23,"NO IWS","NO IWS",0.5,59.850322222992169,2.4253343496639177,19.957036934377381,17.767306492966529,37.724343427343911]
["B",12,30,"NO IWS","NO IWS",0.5,60.924398863557613,1.240385281685261,19.929318827524082,17.905897027233042,37.835215854757124]
["B",18,45,"NO IWS","NO IWS",0.5,61.499549580763635,0.28411059524634469,19.922389300810757,18.293950523179262,38.216339823990019]
["B",18,45,3,7.5,0.5,42.415633012265261,0.31182870209964658,19.922389300810757,37.350148984824337,57.272538285635093]
{"$rows_left_out":53}
{"sheet":"Soil Group C","index":6,"n_rows":72,"n_cols":11,"rows_kept":72,"cut":false,"hidden":true,"merged":[]}
[]
["Soil Type","Profile Depth","Profile Depth","Depth of IWS","Depth of IWS","Run-on Ratio","% Drainage","% Runoff","% Evap","% Exfiltration","% Evap + Exf"]
["C",9,23,"NO IWS","NO IWS",0,69.455998695049331,1.4762254302259197,23.472799934752466,5.5949759399722829,29.067775874724749]
["C",12,30,"NO IWS","NO IWS",0,70.238969088981321,0.70956691950085626,23.44833210994209,5.6031318815757345,29.051463991517824]
["C",18,45,"NO IWS","NO IWS",0,70.785417176413006,4.89356496207487E-2,23.44833210994209,5.7173150640241559,29.165647173966246]
["C",18,45,3,7.5,0,59.130576625071349,8.9715357638039311E-2,23.44833210994209,17.331375907348519,40.779708017290609]
["C",18,45,6,15,0,40.730772367669836,0.16311883206916236,23.44833210994209,35.657776690318912,59.106108800260998]
["C",24,60,"NO IWS","NO IWS",0,70.842508767637213,0,23.44833210994209,5.7091591224206972,29.157491232362787]
["C",24,60,3,7.5,0,59.163200391485191,0,23.44833210994209,17.388467498572719,40.836799608514809]
["C",24,60,6,15,0,40.649212951635263,0,23.44833210994209,35.90245493842265,59.350787048364737]
["C",24,60,12,30,0,14.370769105293208,3.2623766413832481E-2,23.44833210994209,62.148275018350873,85.596607128292959]
["C",36,90,"NO IWS","NO IWS",0,71.038251366120193,0,23.44833210994209,5.5134165239377175,28.961748633879807]
["C",36,90,3,7.5,0,59.367098931571647,0,23.44833210994209,17.184568958486263,40.632901068428353]
["C",36,90,6,15,0,40.804175842100967,0,23.44833210994209,35.747492047956939,59.195824157899025]
["C",36,90,12,30,0,14.321833455672452,0,23.44833210994209,62.229834434385467,85.678166544327553]
["C",36,90,18,45,0,4.5754832395400049,0,23.44833210994209,71.976184650517908,95.424516760459994]
["C",9,23,"NO IWS","NO IWS",0.5,72.420483680964594,2.5777839373570788,19.970895987804031,5.0308363938742957,25.001732381678327]
["C",12,30,"NO IWS","NO IWS",0.5,73.6747280160765,1.3443281823851432,19.929318827524082,5.051624974014274,24.980943801538356]
["C",18,45,"NO IWS","NO IWS",0.5,74.575566488808818,0.33954680895294848,19.922389300810757,5.1624974014274763,25.084886702238233]
["C",18,45,3,7.5,0.5,64.465387014066948,0.42270112951285421,19.922389300810757,15.189522555609443,35.1119118564202]
{"$rows_left_out":53}
{"sheet":"Soil Group D (avg.)","index":7,"n_rows":72,"n_cols":11,"rows_kept":72,"cut":false,"hidden":true,"merged":[]}
[]
["Soil Type","Profile Depth","Profile Depth","Depth of IWS","Depth of IWS","Run-on Ratio","% Drainage","% Runoff","% Evap","% Exfiltration","% Evap + Exf"]
["D (avg.)",9,23,"NO IWS","NO IWS",0,72.40029361389773,1.4925373134328359,23.472799934752466,2.6343691379169663,26.107169072669432]
["D (avg.)",12,30,"NO IWS","NO IWS",0,73.199575891036616,0.71772286110431449,23.456488051545552,2.6262131963135182,26.08270124785907]
["D (avg.)",18,45,"NO IWS","NO IWS",0,73.852051219313267,5.7091591224206845E-2,23.448332109942093,2.642525079520432,26.090857189462525]
["D (avg.)",18,45,3,7.5,0,67.604599951064344,9.7871299241497428E-2,23.448332109942093,8.8491966397520656,32.297528749694159]
["D (avg.)",18,45,6,15,0,55.966071282929619,0.21205448168991112,23.448332109942093,20.373542125438377,43.82187423538047]
["D (avg.)",24,60,"NO IWS","NO IWS",0,73.958078460158234,0,23.448332109942093,2.5935894298996729,26.041921539841766]
["D (avg.)",24,60,3,7.5,0,67.718783133512758,0,23.448332109942093,8.8328847565451483,32.281216866487242]
["D (avg.)",24,60,6,15,0,56.088410406981481,0,23.448332109942093,20.463257483076426,43.911589593018519]
["D (avg.)",24,60,12,30,0,32.387244107332194,8.9715357638039311E-2,23.448332109942093,44.074708425087671,67.523040535029764]
["D (avg.)",36,90,"NO IWS","NO IWS",0,74.16197700024469,0,23.448332109942093,2.3896908898132168,25.83802299975531]
["D (avg.)",36,90,3,7.5,0,67.922681673599214,0,23.448332109942093,8.6289862164586921,32.077318326400786]
["D (avg.)",36,90,6,15,0,56.275997063861027,0,23.448332109942093,20.27567082619688,43.724002936138973]
["D (avg.)",36,90,12,30,0,32.428023815349484,0,23.448332109942093,44.123644074708416,67.571976184650509]
["D (avg.)",36,90,18,45,0,16.246635674088576,0,23.448332109942093,60.305032215969327,83.75336432591142]
["D (avg.)",9,23,"NO IWS","NO IWS",0.5,75.053703832028276,2.5985725174970549,19.970895987804031,2.3768276626706388,22.34772365047467]
["D (avg.)",12,30,"NO IWS","NO IWS",0.5,76.335666273993482,1.3581872358117939,19.929318827524082,2.3768276626706424,22.306146490194724]
["D (avg.)",18,45,"NO IWS","NO IWS",0.5,77.333518120712355,0.35340586237959948,19.922389300810757,2.3906867160972887,22.313076016908045]
["D (avg.)",18,45,3,7.5,0.5,71.928487284318479,0.44348970965283074,19.922389300810757,7.7056337052179344,27.628023006028691]
{"$rows_left_out":53}
{"sheet":"Soil Group D (extreme)","index":8,"n_rows":72,"n_cols":11,"rows_kept":72,"cut":false,"hidden":true,"merged":[]}
[]
["Soil Type","Profile Depth","Profile Depth","Depth of IWS","Depth of IWS","Run-on Ratio","% Drainage","% Runoff","% Evap","% Exfiltration","% Evap + Exf"]
["D (extreme)",9,23,"NO IWS","NO IWS",0,74.153821058641213,1.5006932550362939,23.472799934752466,0.87268575157002815,24.345485686322494]
["D (extreme)",12,30,"NO IWS","NO IWS",0,74.977571160590486,0.72587880270777261,23.456488051545549,0.84006198515619346,24.296550036701742]
["D (extreme)",18,45,"NO IWS","NO IWS",0,75.711605904901703,5.7091591224206831E-2,23.44833210994209,0.78297039393200052,24.23130250387409]
["D (extreme)",18,45,3,7.5,0,73.835739336106357,9.78712992414974E-2,23.44833210994209,2.618057254710056,26.066389364652146]
["D (extreme)",18,45,6,15,0,70.01875866568794,0.23652230650028544,23.44833210994209,6.2963869178696861,29.744719027811776]
["D (extreme)",24,60,"NO IWS","NO IWS",0,75.858412853763966,0,23.44833210994209,0.69325503629394447,24.141587146236034]
["D (extreme)",24,60,3,7.5,0,74.015170051382412,0,23.44833210994209,2.5364978386754977,25.984829948617588]
["D (extreme)",24,60,6,15,0,70.312372563412424,0,23.44833210994209,6.239295326645486,29.687627436587576]
["D (extreme)",24,60,12,30,0,61.169562025935889,0.15496289046570424,23.44833210994209,15.227142973656317,38.675475083598407]
["D (extreme)",36,90,"NO IWS","NO IWS",0,76.062311393850422,0,23.44833210994209,0.48935649620748833,23.937688606149578]
["D (extreme)",36,90,3,7.5,0,74.219068591468869,0,23.44833210994209,2.3325992985890416,25.780931408531131]
["D (extreme)",36,90,6,15,0,70.51627110349888,0,23.44833210994209,6.0353967865590299,29.48372889650112]
["D (extreme)",36,90,12,30,0,61.463175923660387,0,23.44833210994209,15.088491966397523,38.536824076339613]
["D (extreme)",36,90,18,45,0,52.630291167115239,0,23.44833210994209,23.921376722942671,47.369708832884761]
["D (extreme)",9,23,"NO IWS","NO IWS",0.5,76.633635922666485,2.612431570923706,19.970895987804031,0.78303651860577617,20.753932506409807]
["D (extreme)",12,30,"NO IWS","NO IWS",0.5,77.943316471485005,1.3720462892384451,19.929318827524082,0.75531841175246939,20.684637239276551]
["D (extreme)",18,45,"NO IWS","NO IWS",0.5,79.017393112050456,0.36033538909292495,19.922389300810757,0.69988219804586294,20.62227149885662]
["D (extreme)",18,45,3,7.5,0.5,77.354306700852334,0.45734876307948169,19.922389300810757,2.2659552352574295,22.188344536068186]
{"$rows_left_out":52}