{"text_format":"1","workbook":"xlsx","n_sheets":9,"sheets":["About PermPave HyPerMod","PermPave HyPerMod","All_Simulations_PP","All_Graphs","Soil Group A","Soil Group B","Soil Group C","Soil Group D (avg.)","Soil Group D (extreme)"],"not_rendered":{"charts":45,"images":5,"macros":1,"external_links":0,"defined_names":16,"comments":1,"pivot_tables":0},"unopened":[],"bounds":{"document_bytes":16777216,"sheet_cells":100000,"rows_first":2000,"rows_last":500,"rows_between":2000,"halvings":0,"cell_chars":16384,"cell_head_chars":4096},"cells_cut":0,"cells_raw":0,"read":"whole","date_system":"1900"}

{"sheet":"About PermPave HyPerMod","index":0,"n_rows":70,"n_cols":10,"rows_kept":70,"cut":false,"hidden":false,"merged":[[20,1,20,7],[29,1,29,7],[37,1,37,7],[2,0,2,8],[8,0,8,8],[11,1,18,7],[30,1,35,7],[10,1,10,7],[3,1,3,7],[5,1,5,7],[6,1,6,7],[7,1,7,7],[4,1,4,7],[72,1,72,7],[73,1,73,7],[69,1,71,7],[26,9,26,10],[21,1,27,7],[47,1,49,7],[61,1,63,7],[65,1,67,7],[51,1,51,7],[52,1,54,7],[56,1,56,7],[57,1,59,7],[39,1,41,7],[43,1,45,7]]}
["North Carolina Long-Term Permeable Pavement Hydrologic Performance Model"]
[]
["LONG-TERM MODELING OF BIORETENTION HYDROLOGY WITH DRAINMOD"]
[null,"Developed by: Drs. Alessandra P. Smolek and William F. Hunt"]
[null,"User Interface by: Brad J. Wardynski and Alessandra Smolek"]
[null,"Department of Biological and Agricultural Engineering"]
[null,"North Carolina State University, Raleigh, North Carolina"]
[null,"Contact: Dr. William (Bill) F. Hunt, 919-515-6715, bill_hunt@ncsu.edu"]
[]
[]
[null,"INTRODUCTION"]
[null,"Previous permerable pavement design standards in North Carolina relied upon capture and treatment of a specific water quality volume.  This \"one size fits all\" approach, while conservative, does not allow designers and regulators to assess the average annual performance of permeable pavements with varying design features.  DRAINMOD allows for accurate long-term prediction of permeable pavement hydrology by simulating drainage system designs under complex saturated and unsaturated conditions using real weather data. Output from DRAINMOD simulations of various permeable pavement designs for the state of North Carolina are provided in this model."]
[]
[]
[]
[]
[]
[]
[]
[]
[null,"MODEL APPLICATIONS"]
[null,"The North Carolina Long-Term Permeable Pavement Hydrologic Performance Model (PermPave HyPerMod) may be used to estimate the hydrologic and water quality functions of permeable pavement cells with specific hydraulic design features.  Analysis is performed on an arbitrary permeable pavement application containing the NCDEQ recommended aggregate specifications.  Designs can be optimized for project constraints by adjusting the profile depth,  internal water storage (IWS), and run-on ratio (ratio of contributing drainage area to permeable pavement surface area). "]
[]
[]
[]
[]
[null,null,null,null,null,null,null,null,null,"Project Partners"]
[]
[]
[null,"MODEL LIMITATIONS"]
[null,"This model may be used as a tool to analyze permeable pavement performance, however, all models are approximations of reality; users should understand the inherent error associated with the model output [see Smolek et. al (submitted), Smolek et al. (submitted) and Smolek (2016) for more model details].  "]
[]
[]
[]
[]
[]
[]
[null,"REFERENCES"]
[null,"Model"]
[null,"Smolek, A. P., Winston, R. J., Dorsey, J. D., Youssef, M. and Hunt, W. F. (submitted). “Calibration and validation of DRAINMOD to predict annual permeable pavement hydrology.” Journal of Hydrology."]
[]
[]
[]
[null,"Smolek, A. P., Winston, R. J., Dorsey, J. D., and Hunt, W. F. (submitted). “Modeling the influence of design parameters on annual permeable pavement hydrology using DRAINMOD.” Journal of Environmental Management."]
[]
[]
[]
[null,"Smolek, A.P. (2016). Monitoring and modeling the performance of ultra-urban stormwater control measures in North Carolina and Ohio.Dissertation, North Carolina State University. Raleigh, NC."]
[]
[]
[]
[null,"Average Runoff Nutrient Concentrations"]
[null,"Passeport, E., and W.F. Hunt. (2009). \"Asphalt Parking Lot Runoff Nutrient Characterization for Eight Sites in North Carolina, USA.\" Journal of Environmental Engineering. 14(4): 352-361."]
[]
[]
[]
[null,"Average Permeable Pavement Drainage Effluent Concentrations"]
[null,"Bean, E., Hunt, W., and Bidelspach, D. (2007). “Evaluation of four permeable pavement sites in Eastern North Carolina for runoff reduction and water quality impacts.” Journal of Irrigation and Drainage Engineering, 133(6), 583-592. "]
[]
[]
[]
[null,"Collins, K. A., Hunt, W., and Hathaway, J. (2010). “Side-by-side comparison of nitrogen species removal for four types of permeable pavement and standard asphalt in eastern North Carolina.” J. Hydrol. Eng., 15(6), 512-521. "]
[]
[]
[]
[null,"Smolek, A. P., Anderson, A. R., and Hunt, W. F. (submitted). “Hydrologic and water quality evaluation of a permeable pavement and biofiltration device in series.” Journal of Sustainable Water in the Built Environment."]
[]
[]
[]
[null,"Smolek, A.P., Winston, R.J, and Hunt, W.F. (submitted). \"Hydrologic and water quality performance of permeable pavement with internal water storage over a clay soil in Durham, North Carlina.\" Science of the Total Environment"]

{"sheet":"PermPave HyPerMod","index":1,"n_rows":49,"n_cols":13,"rows_kept":49,"cut":false,"hidden":false,"merged":[[44,5,44,11],[48,5,50,11],[27,2,28,2],[18,2,19,2],[33,0,33,11],[34,0,43,11],[47,5,47,10],[2,12,43,14],[4,2,4,3],[5,2,5,3],[6,2,6,3],[10,2,10,3],[12,2,12,3]]}
["North Carolina Long-Term Permeable Pavement Hydrologic Performance Model"]
["DESIGN INPUT PARAMETERS",null,null,null,null,null,null,null,null,null,null,null,"NOTES"]
["Units","English"]
["Hydrologic Soil Group","A"]
["Profile Depth (Pavement + Aggregate)",18,{"$f":"IF(B3=\"SI\",IF(OR(B5=23,B5=30,B5=45,B5=60,B5=90),\"cm\",\"PLEASE UPDATE!\"),IF(B3=\"ENGLISH\",IF(OR(B5=9,B5=12,B5=18,B5=24,B5=36),\"in\",\"PLEASE UPDATE!\")))","v":"in"}]
["Depth of IWS",6,{"$f":"IF(AND(B3=\"SI\",OR(B5=23,B5=30),OR(B6=7.5,B6=15,B6=30,B6=45)),\"PLEASE UPDATE!\",IF(AND(B3=\"English\",OR(B5=9,B5=12),OR(B6=3,B6=6,B6=12,B6=18)),\"PLEASE UPDATE!\",IF(B3=\"SI\",IF(OR(B6=\"NO IWS\",B6=7.5,B6=15,B6=30,B6=45),\"cm\",\"PLEASE UPDATE!\"),IF(B3=\"ENGLISH\",IF(OR(B6=\"NO IWS\",B6=3,B6=6,B6=12,B6=18),\"in\",\"PLEASE UPDATE!\")))))","v":"in"}]
["Run-on Ratio",1]
["Factor of Safety","NONE"]
[]
["WATER QUALITY CHARACTERIZATION"]
["Runoff Avg TN Conc.",1.63,"mg/L"]
["Drainage Avg TN Conc.",1.1100000000000001,"mg/L"]
["Runoff Avg TP Conc.",0.19,"mg/L"]
["Drainage Avg TP Conc.",0.05,"mg/L"]
[]
["DESIGN OUTPUT PARAMETERS"]
["Maximum Subgrade Ksat",{"$f":"IF(B3=\"SI\",HLOOKUP(B4,All_Simulations_PP!B1:F2,2),HLOOKUP(B4,All_Simulations_PP!B1:F3,3))","v":1.18},{"$f":"IF(B3=\"SI\",\"cm/hr\",\"in/hr\")","v":"in/hr"}]
[]
["HYDROLOGY",{"$f":"IF(B3=\"SI\",\"Total (cm/yr)\",\"Total (in/yr)\")","v":"Total (in/yr)"},"Percent \nof Total"]
["Total Inflow (Rainfall + Runoff)",{"$f":"IF(B3=\"SI\",INDEX(RAINFALLSI,MATCH(B4&B5&B6&B7,SOILGROUP&PROFILEDEPTHSI&IWS&RUNON,0)),INDEX(RAINFALLSI,MATCH(B4&B5&B6&B7,SOILGROUP&PROFILEDEPTH&IWSENG&RUNON,0))/2.54)","v":71.055118110236222}]
["Drainage",{"$f":"IF(B8=\"NONE\",IF(B3=\"SI\",INDEX(DRAINAGE,MATCH(B4&B5&B6&B7,SOILGROUP&PROFILEDEPTHSI&IWS&RUNON,0)), INDEX(DRAINAGE,MATCH(B4&B5&B6&B7,SOILGROUP&PROFILEDEPTH&IWSENG&RUNON,0))/2.54),IF(B3=\"SI\",INDEX(Drainage10,MATCH(B4&B5&B6&B7,SOILGROUP&PROFILEDEPTHSI&IWS&RUNON,0)),INDEX(Drainage10,MATCH(B4&B5&B6&B7,SOILGROUP&PROFILEDEPTH&IWSENG&RUNON,0))/2.54))","v":5.5393700787401574},{"$f":"IF(B21=\"\",\"\",B21/$B$20)","v":7.7958776595744683E-2}]
["Surface Runoff",{"$f":"IF(B8=\"NONE\",IF(B3=\"SI\",INDEX(RUNOFF,MATCH(B4&B5&B6&B7,SOILGROUP&PROFILEDEPTHSI&IWS&RUNON,0)), INDEX(RUNOFF,MATCH(B4&B5&B6&B7,SOILGROUP&PROFILEDEPTH&IWSENG&RUNON,0))/2.54),IF(B3=\"SI\",INDEX(Runoff10,MATCH(B4&B5&B6&B7,SOILGROUP&PROFILEDEPTHSI&IWS&RUNON,0)),INDEX(Runoff10,MATCH(B4&B5&B6&B7,SOILGROUP&PROFILEDEPTH&IWSENG&RUNON,0))/2.54))","v":0.30708661417322836},{"$f":"IF(B22=\"\",\"\",B22/$B$20)","v":4.321808510638298E-3}]
["Exfiltration + Evaporation",{"$f":"IF(B8=\"NONE\",IF(B3=\"SI\",INDEX(EvapExfil,MATCH(B4&B5&B6&B7,SOILGROUP&PROFILEDEPTHSI&IWS&RUNON,0)), INDEX(EvapExfil,MATCH(B4&B5&B6&B7,SOILGROUP&PROFILEDEPTH&IWSENG&RUNON,0))/2.54),IF(B3=\"SI\",INDEX(EvapExfil10,MATCH(B4&B5&B6&B7,SOILGROUP&PROFILEDEPTHSI&IWS&RUNON,0)),INDEX(EvapExfil10,MATCH(B4&B5&B6&B7,SOILGROUP&PROFILEDEPTH&IWSENG&RUNON,0))/2.54))","v":65.20866141732283},{"$f":"IF(B23=\"\",\"\",B23/$B$20)","v":0.91771941489361697}]
[]
["VOLUME REDUCTION",{"$f":"C23","v":0.91771941489361697}]
["TREATS 90% OF RUNOFF?",{"$f":"IF(B20=\"\",\"\",IF(C22>10%,\"NO\",\"YES\"))","v":"YES"}]
[]
["WATER QUALITY",{"$f":"IF(B3=\"SI\",\"Total (kg/ha-yr)\",\"Total (lb/ac-yr)\")","v":"Total (lb/ac-yr)"},"Percent Reduction"]
["Influent Avg Total N",{"$f":"IF(B3=\"SI\",IF(B20=\"\",\"\",(B20*B11)*0.1/(1+B7)),IF(B20=\"\",\"\",(B20*B11)*2.54*0.8922*0.1/(1+B7)))","v":13.123476864000001}]
["Effluent Avg Total N",{"$f":"IF(B3=\"SI\",IF(B20=\"\",\"\",(B22*B11*0.1/(1+B7))+(B21*B12*0.1/(1+B7))),IF(B20=\"\",\"\",(B22*B11*0.1/(1+B7)*2.54*0.8922)+(B21*B12*0.1/(1+B7)*2.54*0.8922)))","v":0.753422751},{"$f":"IF(B20=\"\",\"\",(B29-B30)/B29)","v":0.94258969945176863}]
["Influent Avg Total P",{"$f":"IF(B3=\"SI\",IF(B20=\"\",\"\",(B20*B13)*0.1/(1+B7)),IF(B20=\"\",\"\",(B20*B13)*2.54*0.8922*0.1/(1+B7)))","v":1.5297304320000003}]
["Effluent Avg Total P",{"$f":"IF(B3=\"SI\",IF(B20=\"\",\"\",(B22*B13*0.1/(1+B7))+(B21*B14*0.1/(1+B7))),IF(B20=\"\",\"\",(B22*B13*0.1/(1+B7)*2.54*0.8922)+(B21*B14*0.1/(1+B7)*2.54*0.8922)))","v":3.799433700000001E-2},{"$f":"IF(B20=\"\",\"\",(B31-B32)/B31)","v":0.9751627239641657}]
[]
[]
[]
[]
[]
[]
[]
[]
[]
[]
[]
[]
[null,null,null,null,"Created by: ","Drs. Alessandra P. Smolek and William F. Hunt, NCSU, 2016"]
[null,null,null,null,"Interface by:","Brad J. Wardynski and Dr. Alessandra P. Smolek"]
[null,null,null,null,"Contact: ","Dr. William (Bill) F. Hunt, 919-515-6715, bill_hunt@ncsu.edu"]
[null,null,null,null,"Funding by:  ","Interlocking Concrete Pavement Institute, USEPA - Region 4, National Oceanic Atmospheric Administration"]
[null,null,null,null,"References:","Model:  Smolek et al. (submitted), Smolek et al. (submitted), Smolek (2016).  Influent Concentrations: Passeport and Hunt, 2009.  Effluent Concentrations:  Bean et al. 2007, Collins et al. 2010, Smolek et al. (submitted), Smolek et al. (submitted)."]

{"sheet":"All_Simulations_PP","index":2,"n_rows":361,"n_cols":20,"rows_kept":361,"cut":false,"hidden":true,"merged":[[0,7,0,11]]}
["Soil Type","A","B","C","D (avg.)","D (extreme)",null,"Variable Selection Lists"]
["Ksat (cm/hr)",3,0.35,0.05,0.02,5.0000000000000001E-3,null,"Factors of Safety","Units","Profile Depth","Run-on Ratio","Depth of IWS"]
["Ksat (in/hr)",{"$f":"ROUND(B2/2.54,2)","v":1.18},{"$f":"ROUND(C2/2.54,2)","v":0.14000000000000001},{"$f":"(ROUND(D2/2.54,3))","v":0.02},{"$f":"E2/2.54","v":7.874015748031496E-3},{"$f":"ROUND(F2/2.54,4)","v":2E-3},null,"Safety","Units","Profile Depth","Run-on Ratio","IWS"]
[null,null,null,null,null,null,null,"NONE","SI",{"$f":"IF('PermPave HyPerMod'!B3=\"SI\",23,9)","v":9},0,"NO IWS"]
[null,null,null,null,null,null,null,0.1,"English",{"$f":"IF('PermPave HyPerMod'!B3=\"SI\",30,12)","v":12},0.5,{"$f":"IF(OR('PermPave HyPerMod'!B5=23,'PermPave HyPerMod'!B5=30,'PermPave HyPerMod'!B5=9,'PermPave HyPerMod'!B5=12),\"\",IF('PermPave HyPerMod'!B3=\"SI\",7.5,3))","v":3}]
[null,null,null,null,null,null,null,null,null,{"$f":"IF('PermPave HyPerMod'!B3=\"SI\",45,18)","v":18},1,{"$f":"IF(OR('PermPave HyPerMod'!B5=23,'PermPave HyPerMod'!B5=30,'PermPave HyPerMod'!B5=9,'PermPave HyPerMod'!B5=12),\"\",IF('PermPave HyPerMod'!B3=\"SI\",15,6))","v":6}]
[null,null,null,null,null,null,null,null,null,{"$f":"IF('PermPave HyPerMod'!B3=\"SI\",60,24)","v":24},2,{"$f":"IF(OR('PermPave HyPerMod'!B5=23,'PermPave HyPerMod'!B5=30,'PermPave HyPerMod'!B5=45,'PermPave HyPerMod'!B5=9,'PermPave HyPerMod'!B5=12,'PermPave HyPerMod'!B5=18),\"\",IF('PermPave HyPerMod'!B3=\"SI\",30,12))","v":""}]
[null,null,null,null,null,null,null,null,null,{"$f":"IF('PermPave HyPerMod'!B3=\"SI\",90,36)","v":36},4,{"$f":"IF('PermPave HyPerMod'!B3=\"SI\",IF('PermPave HyPerMod'!B5=90,45,\"\"),IF('PermPave HyPerMod'!B3=\"English\",IF('PermPave HyPerMod'!B5=36,18,\"\")))","v":""}]
[]
["A,B,C, or D","9,12,18,24 or 36 in","23, 30, 45, 60 or 90 cm","3, 6, 12, 18 in.","7.5, 15, 30, 45 cm"]
["Soil Type","Profile Depth","Profile Depth","Depth of IWS","Depth of IWS","Run-on Ratio","% Drainage","% Runoff","% Evap","% Exfiltration","% Evap + Exf","Rainfall","Evap","Drainage","Runoff","Exfil","EvapExfil","EvapExfil10","Runoff10","Drainage10"]
["A",9,23,"NO IWS","NO IWS",0,{"$f":"N12/L12*100","v":16.833863469537555},{"$f":"O12/L12*100","v":0.81559416034581189},{"$f":"M12/L12*100","v":23.456488051545549},{"$f":"100-G12-H12-I12","v":58.894054318571079},{"$f":"I12+J12","v":82.350542370116628},108.14000000000001,25.365846178941361,18.204139955957913,0.88198352499796107,63.688030340102763,{"$f":"M12+P12","v":89.053876519044124},{"$f":"Q12*0.9","v":80.148488867139719},{"$f":"O12*1.1","v":0.97018187749775731},{"$f":"L12-(R12+S12)","v":27.021329255362545}]
["A",12,30,"NO IWS","NO IWS",0,17.103009542451673,0.23652230650028544,23.44833210994209,59.21213604110595,{"$f":"I13+J13","v":82.660468151048036},108.14000000000001,25.357026343691381,18.495194519207242,0.25577522224940868,64.032003914851956,{"$f":"M13+P13","v":89.389030258543329},{"$f":"Q13*0.9","v":80.450127232688999},{"$f":"O13*1.1","v":0.2813527444743496},{"$f":"L13-(R13+S13)","v":27.408520022836669}]
["A",18,45,"NO IWS","NO IWS",0,16.988826360003259,0,23.44833210994209,59.562841530054655,83.011173639996741,108.14000000000001,25.357026343691381,18.371716825707527,0,64.41125683060109,89.768283174292463,80.791454856863226,0,27.348545143136789]
["A",18,45,3,7.5,0,8.6860778076828957,0,23.44833210994209,67.865590082375022,91.313922192317108,108.14000000000001,25.357026343691381,9.3931245412282856,0,73.389849115080324,98.746875458771711,88.872187912894546,0,19.267812087105469]
["A",18,45,6,15,0,2.8301117363999673,0,23.44833210994209,73.721556153657943,97.169888263600029,108.14000000000001,25.357026343691381,3.0604828317429251,0,79.722490824565696,105.07951716825707,94.571565451431368,0,13.568434548568646]
["A",24,60,"NO IWS","NO IWS",0,16.89911100236522,0,23.44833210994209,59.652556887692697,83.100888997634783,108.14000000000001,25.357026343691381,18.274698637957755,0,64.508275018350872,89.86530136204226,80.878771225838037,0,27.261228774161978]
["A",24,60,3,7.5,0,6.6634042900252819,0,23.44833210994209,69.88826360003263,93.336595709974716,108.14000000000001,25.357026343691381,7.2058053992333413,0,75.577168257075272,100.93419460076666,90.840775140689999,0,17.299224859310016]
["A",24,60,6,15,0,2.7730201451757601,0,23.44833210994209,73.77864774488215,97.226979854824236,108.14000000000001,25.357026343691381,2.9987439849930673,0,79.784229671315558,105.14125601500695,94.627130413506251,0,13.512869586493764]
["A",24,60,12,30,0,0.45673272979365465,0,23.44833210994209,76.094935160264257,99.543267270206343,108.14000000000001,25.357026343691381,0.49391077399885824,0,82.289062882309764,107.64608922600115,96.881480303401034,0,11.258519696598981]
["A",36,90,"NO IWS","NO IWS",0,16.996982301606717,0,23.44833210994209,59.554685588451193,83.003017698393279,108.14000000000001,25.357026343691381,18.380536660957507,0,64.40243699535111,89.759463339042497,80.783517005138251,0,27.356482994861764]
["A",36,90,3,7.5,0,8.6942337492863544,0,23.44833210994209,67.857434140771559,91.305766250713646,108.14000000000001,25.357026343691381,9.4019443764782658,0,73.381029279830358,98.738055623521745,88.864250061169571,0,19.275749938830444]
["A",36,90,6,15,0,2.8382676780034251,0,23.44833210994209,73.713400212054495,97.161732321996581,108.14000000000001,25.357026343691381,3.0693026669929044,0,79.713670989315716,105.0706973330071,94.563627599706393,0,13.576372400293621]
["A",36,90,12,30,0,0.52198026262131969,0,23.44833210994209,76.029687627436587,99.478019737378673,108.14000000000001,25.357026343691381,0.56446945599869514,0,82.218504200309923,107.57553054400131,96.817977489601176,0,11.322022510398838]
["A",36,90,18,45,0,3.2623766413832481E-2,0,23.44833210994209,76.519044123644079,99.967376233586165,108.14000000000001,25.357026343691381,3.5279340999918446E-2,0,82.747694315308692,108.10472065900007,97.294248593100065,0,10.84575140689995]
["A",9,23,"NO IWS","NO IWS",0.5,20.830157300256392,1.5730025639248839,19.929318827524082,57.667521308294639,77.596840135818724,144.31,28.76,30.06,2.27,83.22,111.98,100.78200000000001,2.4970000000000003,41.030999999999992]
["A",12,30,"NO IWS","NO IWS",0.5,21.238999376342594,0.6929526713325479,19.922389300810757,58.145658651514104,78.068047952324861,144.31,28.75,30.65,1,83.91,112.66,101.39400000000001,1.1000000000000001,41.816000000000003]
["A",18,45,"NO IWS","NO IWS",0.5,21.259787956482569,4.8506686993278363E-2,19.922389300810757,58.769316055713396,78.691705356524153,144.31,28.75,30.68,7.0000000000000007E-2,84.81,113.56,102.20400000000001,7.7000000000000013E-2,42.028999999999996]
["A",18,45,3,7.5,0.5,12.237544175732799,4.8506686993278363E-2,19.922389300810757,67.791559836463165,87.713949137273914,144.31,28.75,17.66,7.0000000000000007E-2,97.830000000000013,126.58000000000001,113.92200000000001,7.7000000000000013E-2,30.310999999999993]
["A",18,45,6,15,0.5,4.6912895849213498,4.8506686993278363E-2,19.922389300810757,75.337814427274623,95.260203728085372,144.31,28.75,6.77,7.0000000000000007E-2,108.72000000000001,137.47000000000003,123.72300000000003,7.7000000000000013E-2,20.509999999999977]
["A",24,60,"NO IWS","NO IWS",0.5,21.183563162635991,0,19.922389300810757,58.894047536553252,78.816436837364009,144.31,28.75,30.57,0,84.990000000000009,113.74000000000001,102.36600000000001,0,41.943999999999988]
["A",24,60,3,7.5,0.5,9.8052802993555535,0,19.922389300810757,70.272330399833692,90.194719700644441,144.31,28.75,14.15,0,101.41,130.16,117.14400000000001,0,27.165999999999997]
["A",24,60,6,15,0.5,4.6081352643614446,0,19.922389300810757,75.469475434827785,95.391864735638535,144.31,28.75,6.65,0,108.91,137.66,123.89400000000001,0,20.415999999999997]
["A",24,60,12,30,0.5,0.75531841175247738,0,19.922389300810757,79.322292287436767,99.244681588247516,144.31,28.75,1.0900000000000001,0,114.47,143.22,128.898,0,15.412000000000006]
["A",36,90,"NO IWS","NO IWS",0.5,21.273647009909222,0,19.922389300810757,58.803963689280017,78.726352990090774,144.31,28.75,30.7,0,84.86,113.61,102.249,0,42.061000000000007]
["A",36,90,3,7.5,0.5,12.244473702446124,0,19.922389300810757,67.833136996743121,87.755526297553871,144.31,28.75,17.670000000000002,0,97.89,126.64,113.976,0,30.334000000000003]
["A",36,90,6,15,0.5,4.6497124246413968,0,19.922389300810757,75.427898274547857,95.350287575358607,144.31,28.75,6.71,0,108.85000000000001,137.60000000000002,123.84000000000002,0,20.469999999999985]
["A",36,90,12,30,0.5,0.80382509874575547,0,19.922389300810757,79.273785600443489,99.196174901254238,144.31,28.75,1.1599999999999999,0,114.4,143.15,128.83500000000001,0,15.474999999999994]
["A",36,90,18,45,0.5,0.13859053426650961,0,19.922389300810757,79.939020164922738,99.861409465733487,144.31,28.75,0.2,0,115.36,144.11000000000001,129.69900000000001,0,14.61099999999999]
["A",9,23,"NO IWS","NO IWS",1,25.797872340425538,3.1471631205673756,15.940824468085108,55.114140070921977,71.054964539007088,180.48,28.77,46.56,5.68,99.46999999999997,128.23999999999998,115.41599999999998,6.2480000000000002,58.816000000000003]
["A",12,30,"NO IWS","NO IWS",1,26.512632978723406,1.6677748226950353,15.935283687943263,55.884308510638299,71.81959219858156,180.48,28.76,47.85,3.01,100.86,129.62,116.658,3.3109999999999999,60.510999999999996]
["A",18,45,"NO IWS","NO IWS",1,26.723182624113473,0.4598847517730496,15.929742907801419,56.887189716312058,72.816932624113477,180.48,28.75,48.23,0.83,102.67,131.42000000000002,118.27800000000002,0.91300000000000003,61.288999999999973]
["A",18,45,3,7.5,1,17.425753546099291,0.43218085106382981,15.929742907801419,66.212322695035454,82.14206560283688,180.48,28.75,31.45,0.78,119.49999999999999,148.25,133.42500000000001,0.8580000000000001,46.196999999999974]
["A",18,45,6,15,1,7.7958776595744688,0.43218085106382981,15.929742907801419,75.842198581560268,91.771941489361694,180.48,28.75,14.07,0.78,136.88,165.63,149.06700000000001,0.8580000000000001,30.554999999999978]
["A",24,60,"NO IWS","NO IWS",1,26.750886524822697,5.540780141843972E-2,15.929742907801419,57.263962765957437,73.193705673758856,180.48,28.75,48.28,0.1,103.35,132.1,118.89,0.11000000000000001,61.47999999999999]
["A",24,60,3,7.5,1,14.683067375886525,4.9867021276595744E-2,15.929742907801419,69.337322695035454,85.26706560283688,180.48,28.75,26.5,0.09,125.13999999999999,153.88999999999999,138.501,9.9000000000000005E-2,41.879999999999995]
["A",24,60,6,15,1,7.7515514184397176,4.4326241134751775E-2,15.929742907801419,76.274379432624102,92.204122340425528,180.48,28.75,13.99,0.08,137.65999999999997,166.40999999999997,149.76899999999998,8.8000000000000009E-2,30.623000000000019]
["A",24,60,12,30,1,1.5458776595744681,8.3111702127659573E-2,15.929742907801419,82.441267730496463,98.371010638297889,180.48,28.75,2.79,0.15,148.79,177.54,159.786,0.16500000000000001,20.528999999999996]
["A",36,90,"NO IWS","NO IWS",1,26.839539007092199,0,15.929742907801419,57.230718085106382,73.160460992907801,180.48,28.75,48.44,0,103.28999999999999,132.04,118.836,0,61.643999999999991]
["A",36,90,3,7.5,1,17.50886524822695,0,15.929742907801419,66.56139184397162,82.491134751773046,180.48,28.75,31.6,0,120.13,148.88,133.99199999999999,0,46.488]
["A",36,90,6,15,1,7.8069592198581557,0,15.929742907801419,76.263297872340416,92.193040780141843,180.48,28.75,14.09,0,137.63999999999999,166.39,149.751,0,30.728999999999985]
["A",36,90,12,30,1,1.6012854609929079,0,15.929742907801419,82.468971631205676,98.398714539007102,180.48,28.75,2.89,0,148.84,177.59,159.83100000000002,0,20.648999999999972]
["A",36,90,18,45,1,0.46542553191489361,0,15.929742907801419,83.604831560283685,99.534574468085111,180.48,28.75,0.84,0,150.88999999999999,179.64,161.67599999999999,0,18.804000000000002]
["A",9,23,"NO IWS","NO IWS",2,31.124911003876278,7.5310497587216201,11.395459219998418,49.948580017403685,61.3440392374021,252.82,28.81,78.69,19.04,126.28,155.09,139.58100000000002,20.943999999999999,92.294999999999987]
["A",12,30,"NO IWS","NO IWS",2,32.683332014872242,4.2718139387706673,11.375682303615221,51.669171742741874,63.044854046357095,252.82,28.76,82.63,10.8,130.63,159.38999999999999,143.45099999999999,11.880000000000003,97.489000000000004]
["A",18,45,"NO IWS","NO IWS",2,33.403211771220633,1.7522347915513012,11.375682303615221,53.468871133612836,64.844553437228058,252.82,28.76,84.45,4.43,135.18,163.94,147.54599999999999,4.8730000000000002,100.40100000000001]
["A",18,45,3,7.5,2,24.879360810062494,1.6929040424017088,11.375682303615221,62.052052843920578,73.427735147535799,252.82,28.76,62.9,4.28,156.88,185.64,167.07599999999999,4.7080000000000011,81.036000000000001]
["A",18,45,6,15,2,13.31777549244522,1.6612609761885926,11.375682303615221,73.645281227750971,85.020963531366192,252.82,28.76,33.67,4.2,186.19,214.95,193.45499999999998,4.620000000000001,54.745000000000005]
["A",24,60,"NO IWS","NO IWS",2,33.597025551775964,0.80689818843445937,11.371726920338581,54.224349339450988,65.596076259789569,252.82,28.75,84.94,2.04,137.09,165.84,149.256,2.2440000000000002,101.32]
["A",24,60,3,7.5,2,22.169923265564435,0.77129973894470372,11.371726920338581,65.687050075152285,77.058776995490859,252.82,28.75,56.05,1.95,166.07,194.82,175.33799999999999,2.145,75.336999999999989]
["A",24,60,6,15,2,13.385017008148093,0.7594335891147852,11.371726920338581,74.483822482398523,85.855549402737097,252.82,28.75,33.840000000000003,1.92,188.31,217.06,195.35400000000001,2.1120000000000001,55.353999999999985]
["A",24,60,12,30,2,3.4846926667194058,0.81085357171109873,11.371726920338581,84.332726841230908,95.704453761569482,252.82,28.75,8.81,2.0499999999999998,213.20999999999998,241.95999999999998,217.76399999999998,2.2549999999999999,32.801000000000016]
["A",36,90,"NO IWS","NO IWS",2,33.826437781821056,7.1196898979511106E-2,11.371726920338581,54.730638398860854,66.102365319199436,252.82,28.75,85.52,0.18,138.37,167.12,150.40800000000002,0.19800000000000001,102.21399999999997]
["A",36,90,3,7.5,2,25.247211454789969,7.1196898979511106E-2,11.371726920338581,63.309864725891934,74.681591646230515,252.82,28.75,63.83,0.18,160.06,188.81,169.929,0.19800000000000001,82.692999999999984]
["A",36,90,6,15,2,13.574875405426786,7.1196898979511106E-2,11.371726920338581,74.982200775255137,86.353927695593711,252.82,28.75,34.32,0.18,189.57,218.32,196.488,0.19800000000000001,56.133999999999986]
["A",36,90,12,30,2,3.6310418479550668,6.7241515702871624E-2,11.371726920338581,84.92998971600349,96.301716636342064,252.82,28.75,9.18,0.17,214.72,243.47,219.12299999999999,0.18700000000000003,33.509999999999991]
["A",36,90,18,45,2,1.0877304010758644,9.492919863934815E-2,11.371726920338581,87.445613479946218,98.817340400284792,252.82,28.75,2.75,0.24,221.07999999999998,249.82999999999998,224.84699999999998,0.26400000000000001,27.709000000000003]
["A",9,23,"NO IWS","NO IWS",4,33.381132075471697,17.685534591194969,7.252830188679245,41.680503144654089,48.933333333333337,397.5,28.83,132.69,70.3,165.68,194.51,175.059,77.33,145.11099999999999]
["A",12,30,"NO IWS","NO IWS",4,36.040251572327044,11.771069182389937,7.2477987421383645,44.940880503144655,52.188679245283019,397.5,28.81,143.26,46.79,178.64000000000001,207.45000000000002,186.70500000000001,51.469000000000001,159.32599999999999]
["A",18,45,"NO IWS","NO IWS",4,38.115723270440249,5.534591194968554,7.2377358490566035,49.11194968553459,56.349685534591195,397.5,28.77,151.51,22,195.22000000000003,223.99000000000004,201.59100000000004,24.200000000000003,171.70899999999995]
["A",18,45,3,7.5,4,31.582389937106921,5.4062893081760999,7.2402515723270442,55.77106918238993,63.011320754716976,397.5,28.78,125.54,21.49,221.69,250.47,225.423,23.638999999999999,148.43799999999999]
["A",18,45,6,15,4,20.27421383647799,5.3886792452830194,7.2377358490566035,67.099371069182382,74.337106918238987,397.5,28.77,80.59,21.42,266.71999999999997,295.48999999999995,265.94099999999997,23.562000000000005,107.99700000000001]
["A",24,60,"NO IWS","NO IWS",4,38.759748427672953,3.0842767295597486,7.2352201257861637,50.920754716981136,58.1559748427673,397.5,28.76,154.07,12.26,202.41000000000003,231.17000000000002,208.05300000000003,13.486000000000001,175.96099999999998]
["A",24,60,3,7.5,4,29.761006289308174,2.9886792452830191,7.2352201257861637,60.015094339622642,67.250314465408806,397.5,28.76,118.3,11.88,238.56,267.32,240.58799999999999,13.068000000000001,143.84399999999999]
["A",24,60,6,15,4,20.747169811320752,2.9735849056603776,7.2352201257861637,69.04402515723271,76.279245283018867,397.5,28.76,82.47,11.82,274.45,303.20999999999998,272.88900000000001,13.002000000000001,111.60899999999998]
["A",24,60,12,30,4,{"$f":"N76/L76*100","v":7.6981132075471708},{"$f":"O76/L76*100","v":3.0540880503144652},{"$f":"M76/L76*100","v":7.2352201257861637},{"$f":"100-G76-H76-I76","v":82.012578616352215},89.247798742138372,397.5,28.76,30.6,12.14,326,354.76,319.28399999999999,13.354000000000001,64.862000000000023]
["A",36,90,"NO IWS","NO IWS",4,39.227672955974846,1.1949685534591197,7.232704402515723,52.344654088050312,{"$f":"I77+J77","v":59.577358490566034},397.5,28.75,155.93,4.75,208.07,{"$f":"M77+P77","v":236.82},{"$f":"Q77*0.9","v":213.13800000000001},{"$f":"O77*1.1","v":5.2250000000000005},{"$f":"L77-(R77+S77)","v":179.137}]
["A",36,90,3,7.5,4,32.621383647798737,1.1773584905660377,7.232704402515723,58.968553459119505,66.201257861635227,397.5,28.75,129.66999999999999,4.68,234.4,263.14999999999998,236.83499999999998,5.1479999999999997,155.51700000000002]
["A",36,90,6,15,4,21.162264150943397,1.1698113207547169,7.232704402515723,70.435220125786159,77.667924528301882,397.5,28.75,84.12,4.6500000000000004,279.98,308.73,277.85700000000003,5.1150000000000011,114.52799999999996]
["A",36,90,12,30,4,8.1308176100628931,1.1874213836477987,7.232704402515723,83.449056603773585,90.681761006289307,397.5,28.75,32.32,4.72,331.71,360.46,324.41399999999999,5.1920000000000002,67.894000000000005]
["A",36,90,18,45,4,3.152201257861635,1.1874213836477987,7.232704402515723,88.427672955974842,95.660377358490564,397.5,28.75,12.53,4.72,351.5,380.25,342.22500000000002,5.1920000000000002,50.08299999999997]
["B",9,23,"NO IWS","NO IWS",0,55.770328684446611,1.3865100725878801,23.472799934752466,19.370361308213042,42.843161242965508,108.14000000000001,25.383485849441321,60.310033439360573,1.4993719924965336,20.947108718701575,46.330594568142899,41.697535111328612,1.6493091917461871,64.793155696925226]
["B",12,30,"NO IWS","NO IWS",0,56.455427779137089,0.62800750346627521,23.44833210994209,19.468232607454542,42.916564717396632,108.14000000000001,25.357026343691381,61.050899600358861,0.67912731424843009,21.05294674170133,46.409973085392707,41.768975776853438,0.7470400456732732,65.623984177473304]
["B",18,45,"NO IWS","NO IWS",0,56.700106027240835,2.446782481037435E-2,23.44833210994209,19.827094038006702,43.275426147948792,108.14000000000001,25.357026343691381,61.315494657858245,2.6459505749938828E-2,21.441019492700434,46.798045836391815,42.118241252752632,2.9105456324932711E-2,65.992653290922448]
["B",18,45,3,7.5,0,35.731180164750022,4.89356496207487E-2,23.44833210994209,40.771552075687154,64.21988418562924,108.14000000000001,25.357026343691381,38.639698230160676,5.2919011499877655E-2,44.090356414648063,69.447382758339444,62.502644482505502,5.8210912649865422E-2,45.57914460484465]
["B",18,45,6,15,0,17.086697659244756,5.7091591224206831E-2,23.44833210994209,59.407878639588958,82.856210749531044,108.14000000000001,25.357026343691381,18.477554848707282,6.173884674985728E-2,64.24367996085148,89.600706304542854,80.640635674088571,6.7912731424843012E-2,27.431451594486603]
["B",24,60,"NO IWS","NO IWS",0,56.618546611206256,0,23.44833210994209,19.933121278851655,43.381453388793744,108.14000000000001,25.357026343691381,61.227296305358458,0,21.555677350950166,46.91270369464155,42.221433325177394,0,65.918566674822614]
["B",24,60,3,7.5,0,35.608841040698138,0,23.44833210994209,40.942826849359776,64.391158959301862,108.14000000000001,25.357026343691381,38.507400701410972,0,44.275572954897648,69.632599298589028,62.669339368730128,0,45.470660631269887]
["B",24,60,6,15,0,16.874643177554844,0,23.44833210994209,59.677024712503069,83.125356822445156,108.14000000000001,25.357026343691381,18.248239132207814,0,64.534734524100813,89.891760867792186,80.902584781012976,0,27.237415218987039]
["B",24,60,12,30,0,3.0911018677106266,0,23.44833210994209,73.460566022347294,96.90889813228938,108.14000000000001,25.357026343691381,3.342717559742272,0,79.440256096566344,104.79728244025773,94.317554196231967,0,13.822445803768048]
["B",36,90,"NO IWS","NO IWS",0,56.797977326482339,0,23.44833210994209,19.753690563575571,43.202022673517661,108.14000000000001,25.357026343691381,61.421332680858008,0,21.361640975450616,46.718667319142,42.0468005872278,0,66.093199412772208]
["B",36,90,3,7.5,0,35.755647989560394,0,23.44833210994209,40.796019900497512,64.244352010439599,108.14000000000001,25.357026343691381,38.666157735910616,0,44.116815920398004,69.473842264089384,62.526458037680449,0,45.613541962319566]
["B",36,90,6,15,0,16.996982301606717,0,23.44833210994209,59.554685588451193,83.003017698393279,108.14000000000001,25.357026343691381,18.380536660957507,0,64.40243699535111,89.759463339042497,80.783517005138251,0,27.356482994861764]
["B",36,90,12,30,0,3.1400375173313755,0,23.44833210994209,73.411630372726535,96.859962482668621,108.14000000000001,25.357026343691381,3.3956365712421501,0,79.387337085066477,104.74436342875785,94.269927085882074,0,13.870072914117941]
["B",36,90,18,45,0,0.84821792675964447,0,23.44833210994209,75.703449963298269,99.151782073240355,108.14000000000001,25.357026343691381,0.91726286599787954,0,81.865710790310743,107.22273713400213,96.500463420601918,0,11.639536579398097]
["B",9,23,"NO IWS","NO IWS",0.5,59.850322222992169,2.4253343496639177,19.957036934377381,17.767306492966529,37.724343427343911,144.31,28.8,86.37,3.5,25.64,54.44,48.996000000000002,3.8500000000000005,91.463999999999999]
["B",12,30,"NO IWS","NO IWS",0.5,60.924398863557613,1.240385281685261,19.929318827524082,17.905897027233042,37.835215854757124,144.31,28.76,87.92,1.79,25.839999999999996,54.599999999999994,49.139999999999993,1.9690000000000003,93.201000000000008]
["B",18,45,"NO IWS","NO IWS",0.5,61.499549580763635,0.28411059524634469,19.922389300810757,18.293950523179262,38.216339823990019,144.31,28.75,88.75,0.41,26.400000000000002,55.150000000000006,49.635000000000005,0.45100000000000001,94.22399999999999]
["B",18,45,3,7.5,0.5,42.415633012265261,0.31182870209964658,19.922389300810757,37.350148984824337,57.272538285635093,144.31,28.75,61.21,0.45,53.9,82.65,74.385000000000005,0.49500000000000005,69.429999999999993]
["B",18,45,6,15,0.5,23.144619222507103,0.33954680895294848,19.922389300810757,56.593444667729194,76.515833968539951,144.31,28.75,33.4,0.49,81.67,110.42,99.378,0.53900000000000003,44.393000000000001]
["B",24,60,"NO IWS","NO IWS",0.5,61.62428106160349,6.9295267133254804E-3,19.922389300810757,18.446400110872425,38.368789411683181,144.31,28.75,88.93,0.01,26.619999999999994,55.36999999999999,49.832999999999991,1.1000000000000001E-2,94.466000000000008]
["B",24,60,3,7.5,0.5,42.498787332825167,1.3859053426650961E-2,19.922389300810757,37.564964312937427,57.487353613748184,144.31,28.75,61.33,0.02,54.21,82.960000000000008,74.664000000000016,2.2000000000000002E-2,69.623999999999981]
["B",24,60,6,15,0.5,23.082253482087175,2.0788580139976438E-2,19.922389300810757,56.974568636962097,76.896957937772854,144.31,28.75,33.31,0.03,82.22,110.97,99.873000000000005,3.3000000000000002E-2,44.403999999999996]
["B",24,60,12,30,0.5,5.3495946226872704,6.9295267133254804E-2,19.922389300810757,74.658720809368702,94.581110110179452,144.31,28.75,7.72,0.1,107.74000000000001,136.49,122.84100000000001,0.11000000000000001,21.358999999999995]
["B",36,90,"NO IWS","NO IWS",0.5,61.79058970272331,0,19.922389300810757,18.287020996465934,38.20941029727669,144.31,28.75,89.17,0,26.39,55.14,49.626000000000005,0,94.683999999999997]
["B",36,90,3,7.5,0.5,42.637377867091679,0,19.922389300810757,37.440232832097564,57.362622132908321,144.31,28.75,61.53,0,54.03,82.78,74.50200000000001,0,69.807999999999993]
["B",36,90,6,15,0.5,23.206984962927031,0,19.922389300810757,56.870625736262205,76.793015037072962,144.31,28.75,33.49,0,82.07,110.82,99.738,0,44.572000000000003]
["B",36,90,12,30,0.5,5.3357355692606196,0,19.922389300810757,74.741875129928616,94.664264430739365,144.31,28.75,7.7,0,107.86,136.61000000000001,122.94900000000001,0,21.36099999999999]
["B",36,90,18,45,0.5,1.7323816783313701,0,19.922389300810757,78.345229020857886,98.267618321668635,144.31,28.75,2.5,0,113.06,141.81,127.629,0,16.680999999999997]
["B",9,23,"NO IWS","NO IWS",1,63.558289007092192,4.7595301418439719,15.97406914893617,15.708111702127667,31.682180851063837,180.48,28.83,114.71,8.59,28.349999999999984,57.179999999999978,51.461999999999982,9.4489999999999998,119.56900000000002]
["B",12,30,"NO IWS","NO IWS",1,65.530806737588648,2.5875443262411348,15.946365248226952,15.935283687943263,31.881648936170215,180.48,28.78,118.27,4.67,28.759999999999991,57.539999999999992,51.785999999999994,5.1370000000000005,123.55699999999999]
["B",18,45,"NO IWS","NO IWS",1,66.644503546099301,1.0472074468085106,15.929742907801419,16.378546099290766,32.308289007092185,180.48,28.75,120.28,1.89,29.559999999999988,58.309999999999988,52.478999999999992,2.0790000000000002,125.922]
["B",18,45,3,7.5,1,50.265957446808521,1.0749113475177305,15.929742907801419,32.729388297872326,48.659131205673745,180.48,28.75,90.72,1.94,59.069999999999993,87.82,79.037999999999997,2.1339999999999999,99.307999999999993]
["B",18,45,6,15,1,31.011746453900713,1.1358599290780143,15.929742907801419,51.922650709219859,67.852393617021278,180.48,28.75,55.97,2.0499999999999998,93.71,122.46,110.214,2.2549999999999999,68.010999999999996]
["B",24,60,"NO IWS","NO IWS",1,67.14317375886526,0.3379875886524823,15.929742907801419,16.58909574468084,32.518838652482259,180.48,28.75,121.18,0.61,29.939999999999984,58.689999999999984,52.820999999999984,0.67100000000000004,126.988]
["B",24,60,3,7.5,1,50.69813829787234,0.3656914893617022,15.929742907801419,33.006427304964539,48.936170212765958,180.48,28.75,91.5,0.66,59.569999999999993,88.32,79.488,0.72600000000000009,100.26599999999999]
["B",24,60,6,15,1,31.272163120567377,0.4044769503546099,15.929742907801419,52.393617021276604,68.323359929078023,180.48,28.75,56.44,0.73,94.559999999999988,123.30999999999999,110.97899999999998,0.80300000000000005,68.698000000000008]
["B",24,60,12,30,1,9.3417553191489375,0.54853723404255317,15.929742907801419,{"$f":"100-G118-H118-I118","v":74.179964539007074},90.1097074468085,180.48,28.75,16.86,0.99,133.88,162.63,146.36699999999999,1.089,33.024000000000001]
["B",36,90,"NO IWS","NO IWS",1,67.525487588652481,0,15.929742907801419,{"$f":"100-G119-H119-I119","v":16.5447695035461},32.474512411347519,180.48,28.75,121.87,0,29.859999999999985,58.609999999999985,52.748999999999988,0,127.73099999999999]
["B",36,90,3,7.5,1,51.085992907801426,0,15.929742907801419,{"$f":"100-G120-H120-I120","v":32.984264184397155},48.914007092198574,180.48,28.75,92.2,0,59.529999999999987,88.279999999999987,79.451999999999984,0,101.02800000000001]
["B",36,90,6,15,1,31.665558510638299,0,15.929742907801419,{"$f":"100-G121-H121-I121","v":52.404698581560275},68.334441489361694,180.48,28.75,57.15,0,94.579999999999984,123.32999999999998,110.99699999999999,0,69.483000000000004]
["B",36,90,12,30,1,9.696365248226952,1.6622340425531915E-2,15.929742907801419,74.357269503546092,90.287012411347519,180.48,28.75,17.5,0.03,134.19999999999999,162.94999999999999,146.655,3.3000000000000002E-2,33.792000000000002]
["B",36,90,18,45,1,3.4463652482269507,1.6622340425531915E-2,15.929742907801419,80.607269503546092,96.537012411347519,180.48,28.75,6.22,0.03,145.47999999999999,174.23,156.80699999999999,3.3000000000000002E-2,23.640000000000015]
["B",9,23,"NO IWS","NO IWS",2,64.717981172375602,10.98409935922791,11.407325369828335,12.890594098568151,24.297919468396486,252.82,28.84,163.62,27.77,32.589999999999989,61.429999999999993,55.286999999999992,30.547000000000001,166.98599999999999]
["B",12,30,"NO IWS","NO IWS",2,68.669409065738478,6.5698916224982193,11.399414603275059,13.361284708488245,24.760699311763304,252.82,28.82,173.61,16.61,33.779999999999987,62.599999999999987,56.339999999999989,18.271000000000001,178.209]
["B",18,45,"NO IWS","NO IWS",2,71.628035756664815,2.9348943912665137,11.3835930701685,14.053476781900171,25.437069852068671,252.82,28.78,181.09,7.42,35.529999999999987,64.309999999999988,57.878999999999991,8.1620000000000008,186.779]
["B",18,45,3,7.5,2,58.95498773831185,2.9981805236927461,11.3835930701685,26.663238667826903,38.046831737995404,252.82,28.78,149.05000000000001,7.58,67.409999999999982,96.189999999999984,86.570999999999984,8.338000000000001,157.911]
["B",18,45,6,15,2,42.010125781188194,3.1603512380349654,11.3835930701685,43.445929910608342,54.829522980776844,252.82,28.78,106.21,7.99,109.84,138.62,124.75800000000001,8.7890000000000015,119.27299999999997]
["B",24,60,"NO IWS","NO IWS",2,72.624792342377987,1.6296179099754768,11.371726920338581,14.373862827307956,25.745589747646537,252.82,28.75,183.61,4.12,36.339999999999982,65.089999999999975,58.580999999999982,4.5320000000000009,189.70699999999999]
["B",24,60,3,7.5,2,59.920101257811886,1.6573055929119533,11.371726920338581,27.050866228937579,38.42259314927616,252.82,28.75,151.49,4.1900000000000004,68.389999999999986,97.139999999999986,87.425999999999988,4.6090000000000009,160.78500000000003]
["B",24,60,6,15,2,42.836800886005854,1.7087255755082669,11.375682303615221,44.078791234870657,55.454473538485878,252.82,28.76,108.3,4.32,111.44,140.19999999999999,126.17999999999999,4.7520000000000007,121.88800000000001]
["B",24,60,12,30,2,17.937663159560163,1.9935131714263112,11.375682303615221,68.693141365398304,80.068823669013526,252.82,28.76,45.35,5.04,173.67000000000002,202.43,182.18700000000001,5.5440000000000005,65.08899999999997]
["B",36,90,"NO IWS","NO IWS",2,73.585950478601376,0.45486907681354322,11.371726920338581,14.587453524246499,25.95918044458508,252.82,28.75,186.04,1.1499999999999999,36.880000000000003,65.63,59.067,1.2649999999999999,192.488]
["B",36,90,3,7.5,2,60.873348627482002,0.47069060992010125,11.371726920338581,27.284233842259319,38.6559607625979,252.82,28.75,153.9,1.19,68.97999999999999,97.72999999999999,87.956999999999994,1.3089999999999999,163.554]
["B",36,90,6,15,2,43.805869788782537,0.51024444268649638,11.371726920338581,44.312158848192382,55.683885768530963,252.82,28.75,110.75,1.29,112.02999999999999,140.77999999999997,126.70199999999998,1.4190000000000003,124.69900000000001]
["B",36,90,12,30,2,18.835535163357328,0.62099517443240249,11.371726920338581,69.171742741871697,80.543469662210271,252.82,28.75,47.62,1.57,174.88,203.63,183.267,1.7270000000000003,67.825999999999993]
["B",36,90,18,45,2,8.0136065184716401,0.71592437307175061,11.371726920338581,79.898742188118035,91.270469108456609,252.82,28.75,20.260000000000002,1.81,202,230.75,207.67500000000001,1.9910000000000003,43.153999999999968]
["B",9,23,"NO IWS","NO IWS",4,59.119496855345908,23.954716981132076,7.2779874213836475,9.6477987421383684,16.925786163522016,397.5,28.93,235,95.22,38.349999999999994,67.28,60.552,104.742,232.20599999999999]
["B",12,30,"NO IWS","NO IWS",4,65.285534591194974,17.001257861635217,7.2578616352201264,10.455345911949681,17.713207547169809,397.5,28.85,259.51,67.58,41.559999999999988,70.41,63.369,74.338000000000008,259.79300000000001]
["B",18,45,"NO IWS","NO IWS",4,{"$f":"N140/L140*100","v":71.879245283018875},{"$f":"O140/L140*100","v":9.1044025157232706},{"$f":"M140/L140*100","v":7.2477987421383645},11.768553459119488,19.016352201257853,397.5,28.81,285.72000000000003,36.19,46.779999999999973,75.589999999999975,68.030999999999977,39.808999999999997,289.66000000000003]
["B",18,45,3,7.5,4,63.212578616352197,9.2654088050314449,7.2477987421383645,20.274213836477994,{"$f":"I141+J141","v":27.522012578616359},397.5,28.81,251.27,36.83,80.589999999999989,{"$f":"M141+P141","v":109.39999999999999},{"$f":"Q141*0.9","v":98.46},{"$f":"O141*1.1","v":40.512999999999998},{"$f":"L141-(R141+S141)","v":258.52700000000004}]
["B",18,45,6,15,4,49.866666666666667,9.8314465408805027,7.2503144654088052,33.051572327044028,40.301886792452834,397.5,28.82,198.22,39.08,131.38,160.19999999999999,144.18,42.988,210.33199999999999]
["B",24,60,"NO IWS","NO IWS",4,74.79245283018868,5.4213836477987423,7.2402515723270442,12.545911949685536,19.786163522012579,397.5,28.78,297.3,21.55,49.870000000000019,78.65000000000002,70.785000000000025,23.705000000000002,303.01]
["B",24,60,3,7.5,4,66.153459119496844,5.5069182389937108,7.2402515723270442,21.0993710691824,28.339622641509443,397.5,28.78,262.95999999999998,21.89,83.870000000000047,112.65000000000005,101.38500000000005,24.079000000000004,272.03599999999994]
["B",24,60,6,15,4,52.928301886792454,5.7660377358490571,7.2402515723270442,34.065408805031446,41.305660377358492,397.5,28.78,210.39,22.92,135.41000000000003,164.19000000000003,147.77100000000002,25.212000000000003,224.517]
["B",24,60,12,30,4,29.428930817610066,6.7295597484276728,7.242767295597484,56.598742138364777,63.841509433962258,397.5,28.79,116.98,26.75,224.97999999999996,253.76999999999995,228.39299999999997,29.425000000000001,139.68200000000002]
["B",36,90,"NO IWS","NO IWS",4,77.04402515723271,2.4578616352201257,7.2352201257861637,13.262893081761,20.498113207547163,397.5,28.76,306.25,9.77,52.720000000000013,81.480000000000018,73.332000000000022,10.747,313.42099999999999]
["B",36,90,3,7.5,4,68.445283018867926,2.4880503144654087,7.2377358490566035,21.828930817610065,29.06666666666667,397.5,28.77,272.07,9.89,86.770000000000024,115.54000000000002,103.98600000000002,10.879000000000001,282.63499999999999]
["B",36,90,6,15,4,55.368553459119497,2.561006289308176,7.2352201257861637,34.835220125786165,42.070440251572329,397.5,28.76,220.09,10.18,138.47,167.23,150.50700000000001,11.198,235.79499999999999]
["B",36,90,12,30,4,32.266666666666666,2.7396226415094338,7.2377358490566035,57.755974842767301,64.993710691823907,397.5,28.77,128.26,10.89,229.58000000000004,258.35000000000002,232.51500000000001,11.979000000000001,153.00599999999997]
["B",36,90,18,45,4,17.949685534591193,3.0238993710691822,7.2377358490566035,71.788679245283021,79.026415094339626,397.5,28.77,71.349999999999994,12.02,285.36,314.13,282.71699999999998,13.222000000000001,101.56100000000004]
["C",9,23,"NO IWS","NO IWS",0,69.455998695049331,1.4762254302259197,23.472799934752466,5.5949759399722829,29.067775874724749,108.14000000000001,25.383485849441321,75.109716988826364,1.5963901802463096,6.050406981486014,31.433892830927334,28.2905035478346,1.7560291982709408,78.093467253894474]
["C",12,30,"NO IWS","NO IWS",0,70.238969088981321,0.70956691950085626,23.44833210994209,5.6031318815757345,29.051463991517824,108.14000000000001,25.357026343691381,75.956421172824406,0.76732566674822611,6.0592268167359871,31.416253160427367,28.274627844384632,0.84405823342304875,79.021313922192334]
["C",18,45,"NO IWS","NO IWS",0,70.785417176413006,4.89356496207487E-2,23.44833210994209,5.7173150640241559,29.165647173966246,108.14000000000001,25.357026343691381,76.547350134573037,5.2919011499877655E-2,6.182704510235701,31.539730853927082,28.385757768534376,5.8210912649865422E-2,79.69603131881577]
["C",18,45,3,7.5,0,59.130576625071349,8.9715357638039311E-2,23.44833210994209,17.331375907348519,40.779708017290609,108.14000000000001,25.357026343691381,63.943805562352168,9.7018187749775719E-2,18.74214990620667,44.099176249898051,39.689258624908248,0.1067200065247533,68.344021368567013]
["C",18,45,6,15,0,40.730772367669836,0.16311883206916236,23.44833210994209,35.657776690318912,59.106108800260998,108.14000000000001,25.357026343691381,44.046257238398169,0.1763967049995922,38.560319712910854,63.917346056602234,57.525611450942009,0.19403637549955144,50.420352173558456]
["C",24,60,"NO IWS","NO IWS",0,70.842508767637213,0,23.44833210994209,{"$f":"100-G157-H157-I157","v":5.7091591224206972},29.157491232362787,108.14000000000001,25.357026343691381,76.609088981322898,0,6.173884674985727,31.530911018677109,28.377819916809401,0,79.762180083190614]
["C",24,60,3,7.5,0,59.163200391485191,0,23.44833210994209,{"$f":"100-G158-H158-I158","v":17.388467498572719},40.836799608514809,108.14000000000001,25.357026343691381,63.979084903352096,0,18.803888752956521,44.160915096647898,39.744823586983109,0,68.395176413016912]
["C",24,60,6,15,0,40.649212951635263,0,23.44833210994209,{"$f":"100-G159-H159-I159","v":35.90245493842265},59.350787048364737,108.14000000000001,25.357026343691381,43.958058885898382,0,38.824914770410246,64.181941114101619,57.76374700269146,0,50.376252997308555]
["C",24,60,12,30,0,14.370769105293208,3.2623766413832481E-2,23.44833210994209,{"$f":"100-G160-H160-I160","v":62.148275018350873},85.596607128292959,108.14000000000001,25.357026343691381,15.540549710464076,3.5279340999918446E-2,67.207144604844615,92.564170948536002,83.307753853682399,3.8807275099910291E-2,24.793438871217703]
["C",36,90,"NO IWS","NO IWS",0,71.038251366120193,0,23.44833210994209,5.5134165239377175,28.961748633879807,108.14000000000001,25.357026343691381,76.820765027322395,0,5.9622086289862208,31.319234972677602,28.187311475409842,0,79.952688524590172]
["C",36,90,3,7.5,0,59.367098931571647,0,23.44833210994209,17.184568958486263,40.632901068428353,108.14000000000001,25.357026343691381,64.199580784601594,0,18.583392871707034,43.940419215398414,39.546377293858576,0,68.593622706141446]
["C",36,90,6,15,0,40.804175842100967,0,23.44833210994209,35.747492047956939,59.195824157899025,108.14000000000001,25.357026343691381,44.125635755647991,0,38.657337900660636,64.014364244352009,57.612927819916813,0,50.527072180083202]
["C",36,90,12,30,0,14.321833455672452,0,23.44833210994209,62.229834434385467,85.678166544327553,108.14000000000001,25.357026343691381,15.487630698964194,0,67.295342957344431,92.652369301035804,83.387132370932221,0,24.752867629067794]
["C",36,90,18,45,0,4.5754832395400049,0,23.44833210994209,71.976184650517908,95.424516760459994,108.14000000000001,25.357026343691381,4.9479275752385616,0,77.835046081070061,103.19207242476145,92.87286518228531,0,15.267134817714705]
["C",9,23,"NO IWS","NO IWS",0.5,72.420483680964594,2.5777839373570788,19.970895987804031,5.0308363938742957,25.001732381678327,144.31,28.82,104.51,3.72,7.2600000000000033,36.080000000000005,32.472000000000008,4.0920000000000005,107.746]
["C",12,30,"NO IWS","NO IWS",0.5,73.6747280160765,1.3443281823851432,19.929318827524082,5.051624974014274,24.980943801538356,144.31,28.76,106.32,1.94,7.2900000000000045,36.050000000000004,32.445000000000007,2.1339999999999999,109.73099999999999]
["C",18,45,"NO IWS","NO IWS",0.5,74.575566488808818,0.33954680895294848,19.922389300810757,5.1624974014274763,25.084886702238233,144.31,28.75,107.62,0.49,7.4499999999999975,36.199999999999996,32.58,0.53900000000000003,111.191]
["C",18,45,3,7.5,0.5,64.465387014066948,0.42270112951285421,19.922389300810757,15.189522555609443,35.1119118564202,144.31,28.75,93.03,0.61,21.92,50.67,45.603000000000002,0.67100000000000004,98.036000000000001]
["C",18,45,6,15,0.5,47.903818169219036,0.60286882405931674,19.922389300810757,31.570923705910893,51.49331300672165,144.31,28.75,69.13,0.87,45.560000000000009,74.31,66.879000000000005,0.95700000000000007,76.474000000000004]
["C",24,60,"NO IWS","NO IWS",0.5,74.88739519090845,2.7718106853301921E-2,19.922389300810757,5.1624974014274905,25.084886702238247,144.31,28.75,108.07,0.04,7.4500000000000091,36.20000000000001,32.580000000000013,4.4000000000000004E-2,111.68599999999999]
["C",24,60,3,7.5,0.5,64.770286189453259,5.5436213706603843E-2,19.922389300810757,15.251888296029378,35.174277596840135,144.31,28.75,93.47,0.08,22.010000000000005,50.760000000000005,45.684000000000005,8.8000000000000009E-2,98.537999999999997]
["C",24,60,6,15,0.5,48.174069711038733,9.7013373986556725E-2,19.922389300810757,31.806527614163954,51.728916914974711,144.31,28.75,69.52,0.14000000000000001,45.900000000000006,74.650000000000006,67.185000000000002,0.15400000000000003,76.971000000000004]
["C",24,60,12,30,0.5,20.546046705010045,0.332617282239623,19.922389300810757,59.198946711939577,79.121336012750334,144.31,28.75,29.65,0.48,85.429999999999993,114.17999999999999,102.762,0.52800000000000002,41.019999999999996]
["C",36,90,"NO IWS","NO IWS",0.5,75.088351465594897,0,19.922389300810757,4.9892592335943462,24.911648534405103,144.31,28.75,108.36,0,7.2000000000000028,35.950000000000003,32.355000000000004,0,111.955]
["C",36,90,3,7.5,0.5,64.998960570993006,0,19.922389300810757,15.078650128196237,35.001039429006994,144.31,28.75,93.8,0,21.760000000000005,50.510000000000005,45.459000000000003,0,98.850999999999999]
["C",36,90,6,15,0.5,48.423532672718451,0,19.922389300810757,31.654078026470792,51.576467327281549,144.31,28.75,69.88,0,45.680000000000007,74.430000000000007,66.987000000000009,0,77.322999999999993]
["C",36,90,12,30,0.5,20.740073452983161,0,19.922389300810757,59.337537246206089,79.259926547016846,144.31,28.75,29.93,0,85.63,114.38,102.94199999999999,0,41.368000000000009]
["C",36,90,18,45,0.5,8.2461367888573207,0,19.922389300810757,71.831473910331937,91.753863211142686,144.31,28.75,11.9,0,103.66,132.41,119.169,0,25.141000000000005]
["C",9,23,"NO IWS","NO IWS",1,74.67863475177306,5.0365691489361701,15.968528368794328,4.3162677304964419,20.284796099290769,180.48,28.82,134.78,9.09,7.7899999999999956,36.61,32.948999999999998,9.9990000000000006,137.53199999999998]
["C",12,30,"NO IWS","NO IWS",1,76.928191489361708,2.7814716312056738,15.946365248226952,4.3439716312056671,20.290336879432619,180.48,28.78,138.84,5.0199999999999996,7.8399999999999856,36.61999999999999,32.957999999999991,5.5220000000000002,142]
["C",18,45,"NO IWS","NO IWS",1,78.429742907801426,1.1857269503546102,15.929742907801419,4.454787234042545,20.384530141843964,180.48,28.75,141.55000000000001,2.14,8.0399999999999778,36.789999999999978,33.110999999999983,2.3540000000000005,145.01500000000001]
["C",18,45,3,7.5,1,70.151817375886523,1.2799202127659575,15.935283687943263,12.632978723404255,28.568262411347519,180.48,28.76,126.61,2.31,22.8,51.56,46.404000000000003,2.5410000000000004,131.53499999999997]
["C",18,45,6,15,1,55.939716312056746,1.5625,15.935283687943263,26.562499999999993,42.497783687943254,180.48,28.76,100.96,2.82,47.940000000000005,76.7,69.03,3.1019999999999999,108.34799999999998]
["C",24,60,"NO IWS","NO IWS",1,79.083554964539005,0.53191489361702127,15.929742907801419,{"$f":"100-G185-H185-I185","v":4.4547872340425556},20.384530141843975,180.48,28.75,142.72999999999999,0.96,8.0399999999999991,36.79,33.110999999999997,1.056,146.31299999999999]
["C",24,60,3,7.5,1,70.877659574468083,0.49867021276595747,15.929742907801419,{"$f":"100-G186-H186-I186","v":12.693927304964539},28.623670212765958,180.48,28.75,127.92,0.9,22.909999999999989,51.659999999999989,46.493999999999993,0.9900000000000001,132.99599999999998]
["C",24,60,6,15,1,56.560283687943269,0.74800531914893631,15.929742907801419,{"$f":"100-G187-H187-I187","v":26.761968085106375},42.691710992907794,180.48,28.75,102.08,1.35,48.29999999999999,77.049999999999983,69.344999999999985,1.4850000000000003,109.65]
["C",24,60,12,30,1,30.180629432624112,1.1635638297872342,15.929742907801419,{"$f":"100-G188-H188-I188","v":52.726063829787229},68.655806737588648,180.48,28.75,54.47,2.1,95.16,123.91,111.51900000000001,2.3100000000000005,66.650999999999982]
["C",36,90,"NO IWS","NO IWS",1,79.72074468085107,0,15.929742907801419,{"$f":"100-G189-H189-I189","v":4.3495124113475114},20.27925531914893,180.48,28.75,143.88,0,7.8499999999999943,36.599999999999994,32.94,0,147.54]
["C",36,90,3,7.5,1,71.481604609929079,1.1081560283687944E-2,15.929742907801419,12.577570921985814,28.507313829787233,180.48,28.75,129.01,0.02,22.7,51.45,46.305000000000007,2.2000000000000002E-2,134.15299999999999]
["C",36,90,6,15,1,57.302748226950364,8.3111702127659573E-2,15.929742907801419,26.684397163120558,42.614140070921977,180.48,28.75,103.42,0.15,48.159999999999989,76.91,69.218999999999994,0.16500000000000001,111.09599999999999]
["C",36,90,12,30,1,31.050531914893618,0.11081560283687944,15.929742907801419,52.90890957446809,68.838652482269509,180.48,28.75,56.04,0.2,95.49,124.24,111.816,0.22000000000000003,68.443999999999988]
["C",36,90,18,45,1,15.325797872340427,0.22163120567375888,15.929742907801419,68.522828014184398,84.452570921985824,180.48,28.75,27.66,0.4,123.66999999999999,152.41999999999999,137.178,0.44000000000000006,42.861999999999995]
["C",9,23,"NO IWS","NO IWS",2,73.617593544814497,11.589273000553755,11.407325369828335,3.3858080848034131,14.793133454631748,252.82,28.84,186.12,29.3,8.5599999999999845,37.399999999999984,33.659999999999989,32.230000000000004,186.93]
["C",12,30,"NO IWS","NO IWS",2,78.158373546396646,6.9891622498220087,11.399414603275059,3.4530496005062865,14.852464203781345,252.82,28.82,197.6,17.670000000000002,8.730000000000004,37.550000000000004,33.795000000000002,19.437000000000005,199.58799999999999]
["C",18,45,"NO IWS","NO IWS",2,81.836879993671403,3.1880389209714419,11.37963768689186,3.5954433984652958,14.975081085357155,252.82,28.77,206.9,8.06,9.0899999999999768,37.859999999999978,34.073999999999984,8.8660000000000014,209.88]
["C",18,45,3,7.5,2,75.662526698837112,3.4293173008464524,11.3835930701685,9.5245629301479351,20.908156000316435,252.82,28.78,191.29,8.67,24.08,52.86,47.573999999999998,9.5370000000000008,195.709]
["C",18,45,6,15,2,64.512301241990343,4.0028478759591808,11.3835930701685,20.101257811881979,31.48485088205048,252.82,28.78,163.1,10.119999999999999,50.82,79.599999999999994,71.64,11.132,170.048]
["C",24,60,"NO IWS","NO IWS",2,83.193576457558748,1.8036547741476148,11.375682303615221,{"$f":"100-G199-H199-I199","v":3.6270864646784151},15.002768768293636,252.82,28.76,210.33,4.5599999999999996,9.169999999999991,37.929999999999993,34.136999999999993,5.016,213.667]
["C",24,60,3,7.5,2,77.133929277747015,1.8946285895103234,11.375682303615221,{"$f":"100-G200-H200-I200","v":9.5957598291274415},20.971442132742663,252.82,28.76,195.01,4.79,24.260000000000012,53.02000000000001,47.718000000000011,5.2690000000000001,199.83299999999997]
["C",24,60,6,15,2,66.098409935922803,2.2624792342377975,11.375682303615221,{"$f":"100-G201-H201-I201","v":20.263428526224178},31.639110829839399,252.82,28.76,167.11,5.72,51.22999999999999,79.989999999999995,71.991,6.2919999999999998,174.53699999999998]
["C",24,60,12,30,2,43.283759196266118,3.0733328059488962,11.375682303615221,{"$f":"100-G202-H202-I202","v":42.267225694169767},53.642907997784988,252.82,28.76,109.43,7.77,106.86,135.62,122.05800000000001,8.5470000000000006,122.21499999999997]
["C",36,90,"NO IWS","NO IWS",2,84.427656039870257,0.61308440787912355,11.37963768689186,3.5796218653587601,14.95925955225062,252.82,28.77,213.45,1.55,9.0499999999999936,37.819999999999993,34.037999999999997,1.7050000000000003,217.077]
["C",36,90,3,7.5,2,{"$f":"N204/L204*100","v":78.411518076101586},{"$f":"O204/L204*100","v":0.66054900719879761},{"$f":"M204/L204*100","v":11.371726920338581},9.5562059963610366,20.927932916699618,252.82,28.75,198.24,1.67,24.159999999999982,52.909999999999982,47.618999999999986,1.837,203.364]
["C",36,90,6,15,2,67.557946365002778,0.81480895498773842,11.37963768689186,20.247606993117621,{"$f":"I205+J205","v":31.627244680009483},252.82,28.77,170.8,2.06,51.189999999999969,{"$f":"M205+P205","v":79.959999999999965},{"$f":"Q205*0.9","v":71.96399999999997},{"$f":"O205*1.1","v":2.2660000000000005},{"$f":"L205-(R205+S205)","v":178.59000000000003}]
["C",36,90,12,30,2,45.03994937109406,1.1154180840123409,11.371726920338581,42.472905624555018,53.844632544893599,252.82,28.75,113.87,2.82,107.38,136.13,122.517,3.1019999999999999,127.20099999999999]
["C",36,90,18,45,2,28.197927379163048,1.4990902618463731,11.371726920338581,58.931255438651995,70.302982358990576,252.82,28.75,71.290000000000006,3.79,148.98999999999998,177.73999999999998,159.96599999999998,4.1690000000000005,88.685000000000002]
["C",9,23,"NO IWS","NO IWS",4,65.37358490566038,24.943396226415096,7.2855345911949687,2.3974842767295552,9.6830188679245239,397.5,28.96,259.86,99.15,9.5300000000000011,38.49,34.641000000000005,109.06500000000001,253.79399999999998]
["C",12,30,"NO IWS","NO IWS",4,72.176100628930811,18.037735849056606,7.2628930817610069,2.5232704402515758,9.7861635220125827,397.5,28.87,286.89999999999998,71.7,10.030000000000015,38.90000000000002,35.010000000000019,78.87,283.62]
["C",18,45,"NO IWS","NO IWS",4,80.08805031446542,9.9144654088050306,7.2477987421383645,2.749685534591185,9.9974842767295495,397.5,28.81,318.35000000000002,39.409999999999997,10.929999999999978,39.739999999999981,35.765999999999984,43.350999999999999,318.38300000000004]
["C",18,45,3,7.5,4,75.713207547169802,10.475471698113207,7.2477987421383645,6.5635220125786269,13.811320754716991,397.5,28.81,300.95999999999998,41.64,26.090000000000018,54.90000000000002,49.410000000000018,45.804000000000002,302.28599999999994]
["C",18,45,6,15,4,67.230188679245288,11.916981132075472,7.2553459119496857,13.597484276729556,20.852830188679242,397.5,28.84,267.24,47.37,54.050000000000018,82.890000000000015,74.601000000000013,52.106999999999999,270.79199999999997]
["C",24,60,"NO IWS","NO IWS",4,83.791194968553455,6.090566037735849,7.2452830188679247,2.8729559748427711,10.118238993710696,397.5,28.8,333.07,24.21,11.419999999999995,40.22,36.198,26.631000000000004,334.67099999999999]
["C",24,60,3,7.5,4,79.667924528301896,6.3874213836477987,7.2452830188679247,6.6993710691823818,13.944654088050306,397.5,28.8,316.68,25.39,26.629999999999981,55.429999999999978,49.886999999999979,27.929000000000002,319.68400000000003]
["C",24,60,6,15,4,71.74842767295597,7.1823899371069189,7.2452830188679247,13.823899371069187,21.069182389937112,397.5,28.8,285.2,28.55,54.95,83.75,75.375,31.405000000000005,290.72000000000003]
["C",24,60,12,30,4,53.265408805031441,9.7534591194968563,7.252830188679245,29.728301886792462,36.981132075471706,397.5,28.83,211.73,38.770000000000003,118.17000000000002,147,132.30000000000001,42.647000000000006,222.553]
["C",36,90,"NO IWS","NO IWS",4,86.963522012578622,2.8327044025157235,7.2352201257861637,2.9685534591194909,10.203773584905655,397.5,28.76,345.68,11.26,11.800000000000002,40.56,36.504000000000005,12.386000000000001,348.61]
["C",36,90,3,7.5,4,83.04402515723271,2.9207547169811319,7.2352201257861637,6.7999999999999936,14.035220125786157,397.5,28.76,330.1,11.61,27.029999999999987,55.789999999999992,50.210999999999991,12.771000000000001,334.51800000000003]
["C",36,90,6,15,4,75.677987421383648,3.1371069182389939,7.2377358490566035,13.947169811320753,21.184905660377357,397.5,28.77,300.82,12.47,55.440000000000026,84.210000000000022,75.789000000000016,13.717000000000002,307.99399999999997]
["C",36,90,12,30,4,58.749685534591201,3.9647798742138365,7.2352201257861637,30.050314465408796,37.28553459119496,397.5,28.76,233.53,15.76,119.45,148.21,133.38900000000001,17.336000000000002,246.77499999999998]
["C",36,90,18,45,4,44.228930817610063,5.0666666666666664,7.2377358490566035,43.466666666666669,50.704402515723274,397.5,28.77,175.81,20.14,{"$f":"(L221-M221-N221-O221)","v":172.78000000000003},201.55000000000004,181.39500000000004,22.154000000000003,193.95099999999996]
["D (avg.)",9,23,"NO IWS","NO IWS",0,{"$f":"N222/L222*100","v":72.40029361389773},{"$f":"O222/L222*100","v":1.4925373134328359},{"$f":"M222/L222*100","v":23.472799934752466},{"$f":"100-G222-H222-I222","v":2.6343691379169663},{"$f":"I222+J222","v":26.107169072669432},122.61,28.78,88.77,1.83,3.2300000000000022,{"$f":"M222+P222","v":32.010000000000005},{"$f":"Q222*0.9","v":28.809000000000005},{"$f":"O222*1.1","v":2.0130000000000003},{"$f":"L222-(R222+S222)","v":91.787999999999997}]
["D (avg.)",12,30,"NO IWS","NO IWS",0,73.199575891036616,0.71772286110431449,23.456488051545552,2.6262131963135182,26.08270124785907,122.61,28.76,89.75,0.88,3.2199999999999944,31.979999999999997,28.781999999999996,0.96800000000000008,92.86]
["D (avg.)",18,45,"NO IWS","NO IWS",0,73.852051219313267,5.7091591224206845E-2,23.448332109942093,2.642525079520432,26.090857189462525,122.61,28.75,90.55,7.0000000000000007E-2,3.2400000000000024,31.990000000000002,28.791000000000004,7.7000000000000013E-2,93.74199999999999]
["D (avg.)",18,45,3,7.5,0,67.604599951064344,9.7871299241497428E-2,23.448332109942093,8.8491966397520656,32.297528749694159,122.61,28.75,82.89,0.12,10.85,39.6,35.64,0.13200000000000001,86.837999999999994]
["D (avg.)",18,45,6,15,0,55.966071282929619,0.21205448168991112,23.448332109942093,20.373542125438377,43.82187423538047,122.61,28.75,68.62,0.26,24.979999999999993,53.72999999999999,48.356999999999992,0.28600000000000003,73.967000000000013]
["D (avg.)",24,60,"NO IWS","NO IWS",0,73.958078460158234,0,23.448332109942093,2.5935894298996729,26.041921539841766,122.61,28.75,90.68,0,3.1799999999999926,31.929999999999993,28.736999999999995,0,93.873000000000005]
["D (avg.)",24,60,3,7.5,0,67.718783133512758,0,23.448332109942093,8.8328847565451483,32.281216866487242,122.61,28.75,83.03,0,10.829999999999998,39.58,35.622,0,86.988]
["D (avg.)",24,60,6,15,0,56.088410406981481,0,23.448332109942093,20.463257483076426,43.911589593018519,122.61,28.75,68.77,0,25.090000000000003,53.84,48.456000000000003,0,74.153999999999996]
["D (avg.)",24,60,12,30,0,32.387244107332194,8.9715357638039311E-2,23.448332109942093,44.074708425087671,67.523040535029764,122.61,28.75,39.71,0.11,54.04,82.789999999999992,74.510999999999996,0.12100000000000001,47.978000000000009]
["D (avg.)",36,90,"NO IWS","NO IWS",0,74.16197700024469,0,23.448332109942093,2.3896908898132168,25.83802299975531,122.61,28.75,90.93,0,2.9299999999999926,31.679999999999993,28.511999999999993,0,94.098000000000013]
["D (avg.)",36,90,3,7.5,0,67.922681673599214,0,23.448332109942093,8.6289862164586921,32.077318326400786,122.61,28.75,83.28,0,10.579999999999998,39.33,35.396999999999998,0,87.212999999999994]
["D (avg.)",36,90,6,15,0,56.275997063861027,0,23.448332109942093,20.27567082619688,43.724002936138973,122.61,28.75,69,0,24.86,53.61,48.249000000000002,0,74.36099999999999]
["D (avg.)",36,90,12,30,0,32.428023815349484,0,23.448332109942093,44.123644074708416,67.571976184650509,122.61,28.75,39.76,0,54.1,82.85,74.564999999999998,0,48.045000000000002]
["D (avg.)",36,90,18,45,0,16.246635674088576,0,23.448332109942093,60.305032215969327,83.75336432591142,122.61,28.75,19.920000000000002,0,73.94,102.69,92.421000000000006,0,30.188999999999993]
["D (avg.)",9,23,"NO IWS","NO IWS",0.5,75.053703832028276,2.5985725174970549,19.970895987804031,2.3768276626706388,22.34772365047467,144.31,28.82,108.31,3.75,3.4300000000000068,32.250000000000007,29.025000000000006,4.125,111.16]
["D (avg.)",12,30,"NO IWS","NO IWS",0.5,76.335666273993482,1.3581872358117939,19.929318827524082,2.3768276626706424,22.306146490194724,144.31,28.76,110.16,1.96,3.4300000000000006,32.190000000000005,28.971000000000004,2.1560000000000001,113.18299999999999]
["D (avg.)",18,45,"NO IWS","NO IWS",0.5,77.333518120712355,0.35340586237959948,19.922389300810757,2.3906867160972887,22.313076016908045,144.31,28.75,111.6,0.51,3.4500000000000082,32.20000000000001,28.980000000000011,0.56100000000000005,114.76899999999999]
["D (avg.)",18,45,3,7.5,0.5,71.928487284318479,0.44348970965283074,19.922389300810757,7.7056337052179344,27.628023006028691,144.31,28.75,103.8,0.64,11.120000000000005,39.870000000000005,35.883000000000003,0.70400000000000007,107.723]
["D (avg.)",18,45,6,15,0.5,61.693576328736746,0.68602314461922254,19.922389300810757,17.698011225833277,37.620400526644033,144.31,28.75,89.03,0.99,25.540000000000003,54.290000000000006,48.861000000000004,1.089,94.36]
["D (avg.)",24,60,"NO IWS","NO IWS",0.5,77.69385350980528,3.4647633566627402E-2,19.922389300810757,2.3491095558173356,22.271498856628092,144.31,28.75,112.12,0.05,3.3899999999999979,32.14,28.926000000000002,5.5000000000000007E-2,115.32900000000001]
["D (avg.)",24,60,3,7.5,0.5,72.337329360404681,5.5436213706603843E-2,19.922389300810757,7.6848451250779597,27.607234425888716,144.31,28.75,104.39,0.08,11.090000000000002,39.840000000000003,35.856000000000002,8.8000000000000009E-2,108.366]
["D (avg.)",24,60,6,15,0.5,62.185572725382855,0.13166100755318411,19.922389300810757,17.760376966253205,37.682766267063961,144.31,28.75,89.74,0.19,25.630000000000006,54.38000000000001,48.942000000000007,0.20900000000000002,95.158999999999992]
["D (avg.)",24,60,12,30,0.5,40.302127364700993,0.51971450349941095,19.922389300810757,39.255768830988842,59.178158131799599,144.31,28.75,58.16,0.75,56.650000000000006,85.4,76.860000000000014,0.82500000000000007,66.624999999999986]
["D (avg.)",36,90,"NO IWS","NO IWS",0.5,77.901739311205048,0,19.922389300810757,2.1758713879841949,22.098260688794952,144.31,28.75,112.42,0,3.1400000000000006,31.89,28.701000000000001,0,115.60900000000001]
["D (avg.)",36,90,3,7.5,0.5,72.566003741944414,0,19.922389300810757,7.5116069572448296,27.433996258055586,144.31,28.75,104.72,0,10.840000000000003,39.590000000000003,35.631000000000007,0,108.679]
["D (avg.)",36,90,6,15,0.5,62.47661284734253,0,19.922389300810757,17.600997851846714,37.52338715265747,144.31,28.75,90.16,0,25.400000000000006,54.150000000000006,48.735000000000007,0,95.574999999999989]
["D (avg.)",36,90,12,30,0.5,40.738687547640495,0,19.922389300810757,39.338923151548748,59.261312452359505,144.31,28.75,58.79,0,56.77,85.52000000000001,76.968000000000018,0,67.341999999999985]
["D (avg.)",36,90,18,45,0.5,24.204836809645901,6.9295267133254804E-3,19.922389300810757,55.865844362830025,75.788233663640781,144.31,28.75,34.93,0.01,80.61999999999999,109.36999999999999,98.432999999999993,1.1000000000000001E-2,45.866000000000014]
["D (avg.)",9,23,"NO IWS","NO IWS",1,76.091533687943269,5.9895833333333339,16.046099290780145,1.8727836879432509,17.918882978723396,180.48,28.96,137.33000000000001,10.81,3.3799999999999688,32.339999999999968,29.105999999999973,11.891000000000002,139.483]
["D (avg.)",12,30,"NO IWS","NO IWS",1,78.71786347517731,3.3577127659574471,15.990691489361703,1.9337322695035386,17.924423758865242,180.48,28.86,142.07,6.06,3.4900000000000118,32.350000000000009,29.115000000000009,6.6660000000000004,144.69899999999998]
["D (avg.)",18,45,"NO IWS","NO IWS",1,80.479831560283685,1.5791223404255321,15.97406914893617,1.9669769503546135,17.941046099290784,180.48,28.83,145.25,2.85,3.5499999999999772,32.379999999999974,29.141999999999978,3.1350000000000002,148.203]
["D (avg.)",18,45,3,7.5,1,76.401817375886523,1.3131648936170213,15.935283687943263,6.3497340425531927,22.285017730496456,180.48,28.76,137.88999999999999,2.37,11.460000000000012,40.220000000000013,36.198000000000015,2.6070000000000002,141.67499999999998]
["D (avg.)",18,45,6,15,1,67.94658687943263,1.6566932624113475,15.935283687943263,14.461436170212759,30.396719858156022,180.48,28.76,122.63,2.99,26.1,54.86,49.374000000000002,3.2890000000000006,127.81699999999998]
["D (avg.)",24,60,"NO IWS","NO IWS",1,81.593528368794324,0.43772163120567376,15.929742907801419,2.0390070921985846,17.968750000000004,180.48,28.75,147.26,0.79,3.6799999999999988,32.43,29.187000000000001,0.86900000000000011,150.42399999999998]
["D (avg.)",24,60,3,7.5,1,77.21077127659575,0.52083333333333326,15.929742907801419,6.3386524822694987,22.268395390070918,180.48,28.75,139.35,0.94,11.439999999999996,40.19,36.170999999999999,1.034,143.27499999999998]
["D (avg.)",24,60,6,15,1,68.788785460992912,0.74246453900709231,15.929742907801419,14.539007092198577,30.468749999999996,180.48,28.75,124.15,1.34,26.239999999999984,54.989999999999981,49.490999999999985,1.4740000000000002,129.51499999999999]
["D (avg.)",24,60,12,30,1,49.916888297872347,1.3574911347517733,15.935283687943263,32.790336879432616,48.725620567375877,180.48,28.76,90.09,2.4500000000000002,59.179999999999993,87.94,79.146000000000001,2.6950000000000003,98.638999999999982]
["D (avg.)",36,90,"NO IWS","NO IWS",1,81.831781914893625,0.38231382978723405,15.97406914893617,1.8118351063829721,17.785904255319142,180.48,28.83,147.69,0.69,3.2699999999999796,32.09999999999998,28.889999999999983,0.75900000000000001,150.83100000000002]
["D (avg.)",36,90,3,7.5,1,77.847960992907801,1.1081560283687944E-2,15.929742907801419,6.2112145390070914,22.14095744680851,180.48,28.75,140.5,0.02,11.20999999999999,39.959999999999994,35.963999999999999,2.2000000000000002E-2,144.494]
["D (avg.)",36,90,6,15,1,69.586657801418454,6.6489361702127658E-2,15.929742907801419,14.417109929077998,30.346852836879417,180.48,28.75,125.59,0.12,26.019999999999985,54.769999999999982,49.292999999999985,0.13200000000000001,131.05500000000001]
["D (avg.)",36,90,12,30,1,51.080452127659584,0.14406028368794327,15.929742907801419,32.845744680851055,48.775487588652474,180.48,28.75,92.19,0.26,59.279999999999994,88.03,79.227000000000004,0.28600000000000003,100.96699999999998]
["D (avg.)",36,90,18,45,1,34.862588652482273,0.48758865248226951,15.929742907801419,48.720079787234035,64.649822695035454,180.48,28.75,62.92,0.88,87.929999999999993,116.67999999999999,105.012,0.96800000000000008,74.499999999999986]
["D (avg.)",9,23,"NO IWS","NO IWS",2,75.346096036705973,11.652559132979986,11.415236136381615,1.5861086939324256,13.001344830314041,252.82,28.86,190.49,29.46,4.0099999999999696,32.869999999999969,29.582999999999974,32.406000000000006,190.83100000000002]
["D (avg.)",12,30,"NO IWS","NO IWS",2,79.962028320544263,7.0247606993117646,11.403369986551697,1.6098409935922753,13.013210980143972,252.82,28.83,202.16,17.760000000000002,4.0700000000000109,32.900000000000006,29.610000000000007,19.536000000000005,203.67399999999998]
["D (avg.)",18,45,"NO IWS","NO IWS",2,83.747330116288268,3.2196819871845586,11.37963768689186,1.653350209635315,13.032987896527175,252.82,28.77,211.73,8.14,4.1799999999999926,32.949999999999989,29.65499999999999,8.9540000000000006,214.21100000000001]
["D (avg.)",18,45,3,7.5,2,80.3654774147615,3.5202911162091608,11.387548453445138,4.7266830155842001,16.114231469029338,252.82,28.79,203.18,8.9,11.949999999999994,40.739999999999995,36.665999999999997,9.7900000000000009,206.364]
["D (avg.)",18,45,6,15,2,73.680879677240725,4.2797247053239458,11.387548453445138,10.65184716399019,22.039395617435328,252.82,28.79,186.28,10.82,26.93,55.72,50.148000000000003,11.902000000000001,190.76999999999998]
["D (avg.)",24,60,"NO IWS","NO IWS",2,85.159401946048575,1.827387073807452,11.375682303615221,1.6375286765287509,13.013210980143972,252.82,28.76,215.3,4.62,4.1399999999999908,32.899999999999991,29.609999999999992,5.0820000000000007,218.12799999999999]
["D (avg.)",24,60,3,7.5,2,81.951586108693931,1.9420931888299977,11.375682303615221,4.7306383988608509,16.106320702476072,252.82,28.76,207.19,4.91,11.960000000000004,40.720000000000006,36.648000000000003,5.4010000000000007,210.77099999999999]
["D (avg.)",24,60,6,15,2,75.591329799857604,2.3257653666640299,11.37963768689186,10.703267146586507,22.082904833478366,252.82,28.77,191.11,5.88,27.05999999999997,55.82999999999997,50.246999999999971,6.468,196.10500000000002]
["D (avg.)",24,60,12,30,2,60.268174986156161,3.6864172138280202,11.37963768689186,24.665770113123955,36.045407800015816,252.82,28.77,152.37,9.32,62.359999999999978,91.129999999999981,82.016999999999982,10.252000000000001,160.55100000000002]
["D (avg.)",36,90,"NO IWS","NO IWS",2,85.396724942646955,1.7126809587849063,11.442923819318091,1.4476702792500475,12.890594098568139,252.82,28.93,215.9,4.33,3.6599999999999806,32.589999999999982,29.330999999999985,4.7630000000000008,218.726]
["D (avg.)",36,90,3,7.5,2,83.28455027292145,0.68823669013527411,11.371726920338581,4.6554861166046955,16.027213036943277,252.82,28.75,210.56,1.74,11.769999999999991,40.519999999999989,36.467999999999989,1.9140000000000001,214.43799999999999]
["D (avg.)",36,90,6,15,2,77.153706194130208,0.83063048809429629,11.371726920338581,10.643936397436914,22.015663317775495,252.82,28.75,195.06,2.1,26.909999999999989,55.659999999999989,50.093999999999994,2.3100000000000005,200.416]
["D (avg.)",36,90,12,30,2,62.653271101969786,1.2499011154180841,11.371726920338581,24.72510086227355,36.096827782612131,252.82,28.75,158.4,3.16,62.509999999999991,91.259999999999991,82.134,3.4760000000000004,167.20999999999998]
["D (avg.)",36,90,18,45,2,49.327584842971284,1.8748516731271263,11.375682303615221,37.42188118028637,48.797563483901591,252.82,28.76,124.71,4.74,94.610000000000014,123.37000000000002,111.03300000000002,5.2140000000000004,136.57299999999998]
["D (avg.)",9,23,"NO IWS","NO IWS",4,66.515723270440247,25.086792452830188,7.2830188679245271,1.114465408805037,8.3974842767295641,397.5,28.95,264.39999999999998,99.72,4.4300000000000352,33.380000000000038,30.042000000000034,109.69200000000001,257.76599999999996]
["D (avg.)",12,30,"NO IWS","NO IWS",4,73.4188679245283,18.155974842767296,7.2628930817610069,1.1622641509433969,8.4251572327044038,397.5,28.87,291.83999999999997,72.17,4.6200000000000188,33.490000000000023,30.141000000000023,79.387000000000015,287.97199999999998]
["D (avg.)",18,45,"NO IWS","NO IWS",4,81.506918238993705,10.00251572327044,7.2477987421383645,1.2427672955974902,8.4905660377358547,397.5,28.81,323.99,39.76,4.9399999999999906,33.749999999999986,30.374999999999989,43.736000000000004,323.38900000000001]
["D (avg.)",18,45,3,7.5,4,78.835220125786165,10.70943396226415,7.252830188679245,3.20251572327044,10.455345911949685,397.5,28.83,313.37,42.57,12.730000000000011,41.560000000000009,37.404000000000011,46.827000000000005,313.26900000000001]
["D (avg.)",18,45,6,15,4,73.109433962264163,12.621383647798742,7.2553459119496857,7.0138364779874092,14.269182389937095,397.5,28.84,290.61,50.17,27.88000000000001,56.720000000000013,51.048000000000016,55.187000000000005,291.26499999999999]
["D (avg.)",24,60,"NO IWS","NO IWS",4,85.31320754716981,6.1660377358490575,7.2477987421383645,1.2729559748427679,8.5207547169811324,397.5,28.81,339.12,24.51,5.0599999999999916,33.86999999999999,30.482999999999993,26.961000000000006,340.05599999999998]
["D (avg.)",24,60,3,7.5,4,82.996226415094341,6.5157232704402519,7.2452830188679247,3.2427672955974831,10.488050314465408,397.5,28.8,329.91,25.9,12.889999999999965,41.689999999999969,37.520999999999972,28.490000000000002,331.48900000000003]
["D (avg.)",24,60,6,15,4,78.191194968553461,7.4691823899371066,7.2452830188679247,7.0943396226415079,14.339622641509433,397.5,28.8,310.81,29.69,28.199999999999985,56.999999999999986,51.29999999999999,32.659000000000006,313.541]
["D (avg.)",24,60,12,30,4,{"$f":"N286/L286*100","v":65.288050314465409},{"$f":"O286/L286*100","v":11.101886792452831},{"$f":"M286/L286*100","v":7.252830188679245},{"$f":"100-G286-H286-I286","v":16.357232704402517},{"$f":"I286+J286","v":23.610062893081761},397.5,28.83,259.52,44.13,65.020000000000039,{"$f":"M286+P286","v":93.850000000000037},{"$f":"Q286*0.9","v":84.465000000000032},{"$f":"O286*1.1","v":48.543000000000006},{"$f":"L286-(R286+S286)","v":264.49199999999996}]
["D (avg.)",36,90,"NO IWS","NO IWS",4,88.608805031446551,2.8805031446540879,7.2352201257861637,1.275471698113197,8.5106918238993607,397.5,28.76,352.22,11.45,5.0699999999999825,33.829999999999984,30.446999999999985,12.595000000000001,354.45800000000003]
["D (avg.)",36,90,3,7.5,4,86.515723270440247,3.0037735849056602,7.2352201257861637,3.2452830188679282,10.480503144654092,397.5,28.76,343.9,11.94,12.900000000000032,41.660000000000032,37.494000000000028,13.134,346.87199999999996]
["D (avg.)",36,90,6,15,4,82.296855345911951,3.3584905660377355,7.2377358490566035,7.1069182389937104,14.344654088050314,397.5,28.77,327.13,13.35,28.250000000000021,57.020000000000024,51.318000000000026,14.685,331.49699999999996]
["D (avg.)",36,90,12,30,4,71.828930817610058,4.4729559748427672,7.242767295597484,16.455345911949689,23.698113207547173,397.5,28.79,285.52,17.78,65.41,94.199999999999989,84.779999999999987,19.558000000000003,293.16200000000003]
["D (avg.)",36,90,18,45,4,61.227672955974846,6.2490566037735844,7.2477987421383645,25.275471698113208,32.523270440251572,397.5,28.81,243.38,24.84,100.47,129.28,116.352,27.324000000000002,253.82399999999998]
["D (extreme)",9,23,"NO IWS","NO IWS",0,74.153821058641213,1.5006932550362939,23.472799934752466,0.87268575157002815,24.345485686322494,108.14000000000001,25.383485849441321,80.189942092814618,1.6228496859962485,0.94372237174781515,26.327208221189135,23.694487399070223,1.7851346545958735,82.660377946333924]
["D (extreme)",12,30,"NO IWS","NO IWS",0,74.977571160590486,0.72587880270777261,23.456488051545549,0.84006198515619346,24.296550036701742,108.14000000000001,25.365846178941361,81.080745453062562,0.7849653372481854,0.90844303074788868,26.27428920968925,23.646860288720326,0.86346187097300398,83.629677840306684]
["D (extreme)",18,45,"NO IWS","NO IWS",0,75.711605904901703,5.7091591224206831E-2,23.44833210994209,0.78297039393200052,24.23130250387409,108.14000000000001,25.357026343691381,81.874530625560709,6.173884674985728E-2,0.84670418399804359,26.203730527689423,23.583357474920483,6.7912731424843012E-2,84.488729793654684]
["D (extreme)",18,45,3,7.5,0,73.835739336106357,9.78712992414974E-2,23.44833210994209,2.618057254710056,26.066389364652146,108.14000000000001,25.357026343691381,79.845968518065419,0.10583802299975531,2.8311671152434532,28.188193458934833,25.369374113041349,0.11642182529973084,82.65420406165893]
["D (extreme)",18,45,6,15,0,70.01875866568794,0.23652230650028544,23.44833210994209,6.2963869178696861,29.744719027811776,108.14000000000001,25.357026343691381,75.718285621074955,0.25577522224940868,6.8089128129842633,32.165939156675641,28.949345241008078,0.2813527444743496,78.909302014517579]
["D (extreme)",24,60,"NO IWS","NO IWS",0,75.858412853763966,0,23.44833210994209,0.69325503629394447,24.141587146236034,108.14000000000001,25.357026343691381,82.033287660060367,0,0.74968599624826182,26.106712339939641,23.496041105945679,0,84.643958894054336]
["D (extreme)",24,60,3,7.5,0,74.015170051382412,0,23.44833210994209,2.5364978386754977,25.984829948617588,108.14000000000001,25.357026343691381,80.040004893564955,0,2.7429687627436583,28.099995106435038,25.289995595791535,0,82.850004404208477]
["D (extreme)",24,60,6,15,0,70.312372563412424,0,23.44833210994209,6.239295326645486,29.687627436587576,108.14000000000001,25.357026343691381,76.035799690074214,0,6.7471739662344072,32.104200309925787,28.89378027893321,0,79.246219721066808]
["D (extreme)",24,60,12,30,0,61.169562025935889,0.15496289046570424,23.44833210994209,15.227142973656317,38.675475083598407,108.14000000000001,25.357026343691381,66.148764374847076,0.16757686974961261,16.466632411711931,41.823658755403315,37.641292879862988,0.18433455672457388,70.314372563412462]
["D (extreme)",36,90,"NO IWS","NO IWS",0,76.062311393850422,0,23.44833210994209,0.48935649620748833,23.937688606149578,108.14000000000001,25.357026343691381,82.253783541309858,0,0.52919011499877167,25.886216458690154,23.297594812821139,0,84.842405187178883]
["D (extreme)",36,90,3,7.5,0,74.219068591468869,0,23.44833210994209,2.3325992985890416,25.780931408531131,108.14000000000001,25.357026343691381,80.260500774814446,0,2.5224728814941679,27.879499225185548,25.091549302666994,0,83.048450697333024]
["D (extreme)",36,90,6,15,0,70.51627110349888,0,23.44833210994209,6.0353967865590299,29.48372889650112,108.14000000000001,25.357026343691381,76.256295571323705,0,6.5266780849849173,31.883704428676296,28.695333985808666,0,79.444666014191341]
["D (extreme)",36,90,12,30,0,61.463175923660387,0,23.44833210994209,15.088491966397523,38.536824076339613,108.14000000000001,25.357026343691381,66.466278443846349,0,16.316695212462278,41.673721556153659,37.506349400538291,0,70.633650599461731]
["D (extreme)",36,90,18,45,0,52.630291167115239,0,23.44833210994209,23.921376722942671,47.369708832884761,108.14000000000001,25.357026343691381,56.914396868118423,0,25.868576788190197,51.225603131881577,46.103042818693417,0,62.036957181306597]
["D (extreme)",9,23,"NO IWS","NO IWS",0.5,76.633635922666485,2.612431570923706,19.970895987804031,0.78303651860577617,20.753932506409807,144.31,28.82,110.59,3.77,1.1300000000000057,29.950000000000006,26.955000000000005,4.1470000000000002,113.208]
["D (extreme)",12,30,"NO IWS","NO IWS",0.5,77.943316471485005,1.3720462892384451,19.929318827524082,0.75531841175246939,20.684637239276551,144.31,28.76,112.48,1.98,1.0899999999999932,29.849999999999994,26.864999999999995,2.1779999999999999,115.26700000000001]
["D (extreme)",18,45,"NO IWS","NO IWS",0.5,79.017393112050456,0.36033538909292495,19.922389300810757,0.69988219804586294,20.62227149885662,144.31,28.75,114.03,0.52,1.0100000000000011,29.76,26.784000000000002,0.57200000000000006,116.95400000000001]
["D (extreme)",18,45,3,7.5,0.5,77.354306700852334,0.45734876307948169,19.922389300810757,2.2659552352574295,22.188344536068186,144.31,28.75,111.63,0.66,3.2700000000000067,32.02000000000001,28.818000000000008,0.72600000000000009,114.76599999999999]
["D (extreme)",18,45,6,15,0.5,73.94497955789619,0.73452983161250096,19.922389300810757,5.3981013096805519,25.320490610491309,144.31,28.75,106.71,1.06,7.790000000000008,36.540000000000006,32.88600000000001,1.1660000000000001,110.258]
["D (extreme)",24,60,"NO IWS","NO IWS",0.5,79.412376134710001,3.4647633566627402E-2,19.922389300810757,0.63058693091261375,20.55297623172337,144.31,28.75,114.6,0.05,0.91000000000000791,29.660000000000007,26.694000000000006,5.5000000000000007E-2,117.56099999999999]
["D (extreme)",24,60,3,7.5,0.5,77.818584990645135,6.2365740419929316E-2,19.922389300810757,2.1966599681241803,22.119049268934937,144.31,28.75,112.3,0.09,3.1700000000000053,31.920000000000005,28.728000000000005,9.9000000000000005E-2,115.483]
["D (extreme)",24,60,6,15,0.5,74.596355068948796,0.13166100755318411,19.922389300810757,5.3495946226872633,25.27198392349802,144.31,28.75,107.65,0.19,7.7199999999999962,36.47,32.823,0.20900000000000002,111.27799999999999]
["D (extreme)",24,60,12,30,0.5,66.412584020511403,0.60286882405931674,19.922389300810757,13.062157854618526,32.984547155429283,144.31,28.75,95.84,0.87,18.849999999999998,47.599999999999994,42.839999999999996,0.95700000000000007,100.51300000000001]
["D (extreme)",36,90,"NO IWS","NO IWS",0.5,79.627191462823092,0,19.922389300810757,0.45041923636615167,20.372808537176908,144.31,28.75,114.91,0,0.65000000000000568,29.400000000000006,26.460000000000004,0,117.85]
["D (extreme)",36,90,3,7.5,0.5,78.054188898898204,0,19.922389300810757,2.0234218002910396,21.945811101101796,144.31,28.75,112.64,0,2.9200000000000017,31.67,28.503000000000004,0,115.807]
["D (extreme)",36,90,6,15,0.5,74.901254244335121,0,19.922389300810757,5.1763564548541225,25.098745755664879,144.31,28.75,108.09,0,7.4699999999999989,36.22,32.597999999999999,0,111.712]
["D (extreme)",36,90,12,30,0.5,67.119395745270594,0,19.922389300810757,12.958214953918649,32.880604254729406,144.31,28.75,96.86,0,18.700000000000003,47.45,42.705000000000005,0,101.60499999999999]
["D (extreme)",36,90,18,45,0.5,59.455339200332617,7.6224793846580277E-2,19.922389300810757,20.546046705010049,40.468436005820806,144.31,28.75,85.8,0.11,29.650000000000006,58.400000000000006,52.560000000000009,0.12100000000000001,91.628999999999991]
["D (extreme)",9,23,"NO IWS","NO IWS",1,78.291223404255334,5.0642730496453909,15.97406914893617,0.67043439716310615,16.644503546099276,180.48,28.83,141.30000000000001,9.14,1.2099999999999653,30.039999999999964,27.035999999999969,10.054000000000002,143.39000000000001]
["D (extreme)",12,30,"NO IWS","NO IWS",1,80.585106382978722,2.8202570921985819,15.946365248226952,0.64827127659574479,16.594636524822697,180.48,28.78,145.44,5.09,1.169999999999991,29.949999999999992,26.954999999999995,5.5990000000000002,147.92599999999999]
["D (extreme)",18,45,"NO IWS","NO IWS",1,82.252881205673759,1.207890070921986,15.929742907801419,0.60948581560283444,16.539228723404253,180.48,28.75,148.44999999999999,2.1800000000000002,1.100000000000001,29.85,26.865000000000002,2.3980000000000006,151.21699999999998]
["D (extreme)",18,45,3,7.5,1,80.873226950354621,1.3297872340425532,15.935283687943263,{"$f":"100-G323-H323-I323","v":1.861702127659564},17.796985815602827,180.48,28.76,145.96,2.4,3.359999999999991,32.11999999999999,28.907999999999991,2.64,148.93199999999999]
["D (extreme)",18,45,6,15,1,77.953235815602838,1.7398049645390072,15.935283687943263,4.3716755319148906,20.306959219858154,180.48,28.76,140.69,3.14,7.8900000000000006,36.650000000000006,32.985000000000007,3.4540000000000006,144.041]
["D (extreme)",24,60,"NO IWS","NO IWS",1,83.072916666666671,0.44880319148936176,15.929742907801419,0.5485372340425485,16.478280141843967,180.48,28.75,149.93,0.81,0.98999999999998289,29.739999999999984,26.765999999999988,0.89100000000000013,152.82300000000001]
["D (extreme)",24,60,3,7.5,1,81.726507092198588,0.53745567375886527,15.929742907801419,1.806294326241126,17.736037234042545,180.48,28.75,147.5,0.97,3.25999999999999,32.009999999999991,28.808999999999994,1.0669999999999999,150.60399999999998]
["D (extreme)",24,60,6,15,1,78.983820921985824,0.75354609929078031,15.929742907801419,4.3328900709219766,20.262632978723396,180.48,28.75,142.55000000000001,1.36,7.8199999999999781,36.569999999999979,32.912999999999982,1.4960000000000002,146.071]
["D (extreme)",24,60,12,30,1,71.974734042553195,1.5292553191489362,15.935283687943263,10.560726950354605,26.496010638297868,180.48,28.76,129.9,2.76,19.059999999999995,47.819999999999993,43.037999999999997,3.036,134.40600000000001]
["D (extreme)",36,90,"NO IWS","NO IWS",1,83.660239361702139,5.5407801418439718E-3,15.929742907801419,0.4044769503545993,16.334219858156018,180.48,28.75,150.99,0.01,0.72999999999998066,29.479999999999979,26.531999999999982,1.1000000000000001E-2,153.93700000000001]
["D (extreme)",36,90,3,7.5,1,82.391400709219852,1.1081560283687944E-2,15.929742907801419,1.6677748226950406,17.59751773049646,180.48,28.75,148.69999999999999,0.02,3.0100000000000011,31.76,28.584000000000003,2.2000000000000002E-2,151.874]
["D (extreme)",36,90,6,15,1,79.837101063829792,3.3244680851063829E-2,15.929742907801419,4.1999113475177268,20.129654255319146,180.48,28.75,144.09,0.06,7.5799999999999867,36.329999999999984,32.696999999999989,6.6000000000000003E-2,147.71699999999998]
["D (extreme)",36,90,12,30,1,73.431959219858157,0.1773049645390071,15.929742907801419,10.460992907801415,26.390735815602834,180.48,28.75,132.53,0.32,18.879999999999988,47.629999999999988,42.86699999999999,0.35200000000000004,137.261]
["D (extreme)",36,90,18,45,1,66.843971631205676,0.59840425531914898,15.929742907801419,16.627881205673759,32.557624113475178,180.48,28.75,120.64,1.08,30.009999999999991,58.759999999999991,52.883999999999993,1.1880000000000002,126.40799999999999]
["D (extreme)",9,23,"NO IWS","NO IWS",2,76.406138754845344,11.668380666086545,11.415236136381615,0.5102444426864956,11.925480579068111,252.82,28.86,193.17,29.5,1.289999999999992,30.149999999999991,27.134999999999994,32.450000000000003,193.23500000000001]
["D (extreme)",12,30,"NO IWS","NO IWS",2,81.057669488173417,7.0366268491416823,11.399414603275059,0.50628905940984126,11.9057036626849,252.82,28.82,204.93,17.79,1.279999999999994,30.099999999999994,27.089999999999996,19.568999999999999,206.161]
["D (extreme)",18,45,"NO IWS","NO IWS",2,84.902302033067016,3.2355035202911164,11.37963768689186,0.48255675975000756,11.862194446641867,252.82,28.77,214.65,8.18,1.2199999999999775,29.989999999999977,26.990999999999978,8.9980000000000011,216.83100000000002]
["D (extreme)",18,45,3,7.5,2,83.676133217308774,3.5638003322521956,11.3835930701685,1.3764733802705305,12.76006645043903,252.82,28.78,211.55,9.01,3.4799999999999809,32.259999999999984,29.033999999999985,9.9110000000000014,213.875]
["D (extreme)",18,45,6,15,2,{"$f":"N338/L338*100","v":80.994383355747175},{"$f":"O338/L338*100","v":4.4498061862194449},{"$f":"M338/L338*100","v":11.387548453445138},3.168262004588243,14.555810458033381,252.82,28.79,204.77,11.25,8.0099999999999909,36.79999999999999,33.11999999999999,12.375000000000002,207.32499999999999]
["D (extreme)",24,60,"NO IWS","NO IWS",2,86.346016929040431,1.8392532236373704,11.375682303615221,0.43904754370697674,{"$f":"I339+J339","v":11.814729847322198},252.82,28.76,218.3,4.6500000000000004,1.1099999999999905,{"$f":"M339+P339","v":29.86999999999999},{"$f":"Q339*0.9","v":26.882999999999992},{"$f":"O339*1.1","v":5.1150000000000011},{"$f":"L339-(R339+S339)","v":220.822}]
["D (extreme)",24,60,3,7.5,2,85.3215726603908,1.9658254884898345,11.375682303615221,1.3369195475041451,12.712601851119366,252.82,28.76,215.71,4.97,3.3799999999999946,32.139999999999993,28.925999999999995,5.4670000000000005,218.42699999999999]
["D (extreme)",24,60,6,15,2,83.118424175302579,2.3574084328771461,11.375682303615221,3.148485088205053,14.524167391820274,252.82,28.76,210.14,5.96,7.960000000000016,36.72000000000002,33.048000000000016,6.556,213.21599999999998]
["D (extreme)",24,60,12,30,2,76.908472430978563,4.0700893916620515,11.37963768689186,7.6418004904675261,19.021438177359386,252.82,28.77,194.44,10.29,19.319999999999986,48.089999999999989,43.280999999999992,11.319000000000001,198.22]
["D (extreme)",36,90,"NO IWS","NO IWS",2,87.643382643778196,0.64077209081560005,11.371726920338581,0.3441183450676224,11.715845265406204,252.82,28.75,221.58,1.62,0.86999999999998057,29.61999999999998,26.657999999999983,1.7820000000000003,224.38]
["D (extreme)",36,90,3,7.5,2,86.682224507554778,0.70010283996519262,11.371726920338581,1.2459457321414487,12.61767265248003,252.82,28.75,219.15,1.77,3.1499999999999875,31.899999999999988,28.70999999999999,1.9470000000000003,222.16300000000001]
["D (extreme)",36,90,6,15,2,84.724309785618217,0.85436278775413343,11.371726920338581,3.0496005062890674,14.421327426627649,252.82,28.75,214.2,2.16,7.7100000000000044,36.460000000000008,32.814000000000007,2.3760000000000003,217.63]
["D (extreme)",36,90,12,30,2,79.677240724626216,1.3764733802705482,11.371726920338581,7.5745589747646562,18.946285895103237,252.82,28.75,201.44,3.48,19.149999999999995,47.899999999999991,43.109999999999992,3.8280000000000003,205.88200000000001]
["D (extreme)",36,90,18,45,2,74.483822482398537,2.1161300530021356,11.375682303615221,12.024365160984107,23.400047464599329,252.82,28.76,188.31,5.35,30.4,59.16,53.244,5.8849999999999998,193.691]
["D (extreme)",9,23,"NO IWS","NO IWS",4,67.197484276729554,25.162264150943397,7.2830188679245271,0.35723270440252186,7.640251572327049,397.5,28.95,267.11,100.02,1.4200000000000017,30.37,27.333000000000002,110.02200000000001,260.14499999999998]
["D (extreme)",12,30,"NO IWS","NO IWS",4,74.166037735849059,18.216352201257859,7.2628930817610069,0.35471698113207495,7.6176100628930818,397.5,28.87,294.81,72.41,1.4099999999999966,30.279999999999998,27.251999999999999,79.650999999999996,290.59699999999998]
["D (extreme)",18,45,"NO IWS","NO IWS",4,82.367295597484286,10.027672955974843,7.2503144654088052,0.35471698113206518,7.6050314465408704,397.5,28.82,327.41000000000003,39.86,1.4099999999999824,30.229999999999983,27.206999999999987,43.846000000000004,326.447]
["D (extreme)",18,45,3,7.5,4,80.988679245283024,10.837735849056603,7.252830188679245,0.92075471698112832,8.1735849056603733,397.5,28.83,321.93,43.08,3.6600000000000108,32.490000000000009,29.24100000000001,47.388000000000005,320.87099999999998]
["D (extreme)",18,45,6,15,4,77.56981132075471,13.11194968553459,7.2553459119496857,2.0628930817610147,9.3182389937107004,397.5,28.84,308.33999999999997,52.12,8.2000000000000526,37.040000000000049,33.336000000000048,57.332000000000001,306.83199999999994]
["D (extreme)",24,60,"NO IWS","NO IWS",4,86.233962264150932,6.1811320754716981,7.2452830188679247,0.33962264150944499,7.5849056603773697,397.5,28.8,342.78,24.57,1.3500000000000156,30.150000000000016,27.135000000000016,27.027000000000001,343.33799999999997]
["D (extreme)",24,60,3,7.5,4,85.247798742138372,6.596226415094339,7.2452830188679247,0.91069182389936465,8.1559748427672893,397.5,28.8,338.86,26.22,3.6199999999999761,32.419999999999973,29.177999999999976,28.842000000000002,339.48]
["D (extreme)",24,60,6,15,4,82.991194968553458,7.7031446540880513,7.2452830188679247,2.060377358490566,9.3056603773584907,397.5,28.8,329.89,30.62,8.1900000000000013,36.99,33.291000000000004,33.682000000000002,330.52699999999999]
["D (extreme)",24,60,12,30,4,75.501886792452837,12.316981132075473,7.252830188679245,4.928301886792446,12.181132075471691,397.5,28.83,300.12,48.96,19.590000000000011,48.420000000000009,43.57800000000001,53.856000000000009,300.06599999999997]
["D (extreme)",36,90,"NO IWS","NO IWS",4,89.514465408805037,2.9559748427672958,7.2377358490566035,0.29182389937106379,7.5295597484276673,397.5,28.77,355.82,11.75,1.160000000000025,29.930000000000025,26.937000000000022,12.925000000000001,357.63799999999998]
["D (extreme)",36,90,3,7.5,4,88.807547169811315,3.0918238993710689,7.2377358490566035,0.86289308176101365,8.1006289308176171,397.5,28.77,353.01,12.29,3.4300000000000281,32.200000000000031,28.980000000000029,13.519,355.00099999999998]
["D (extreme)",36,90,6,15,4,87.308176100628927,3.4415094339622643,7.2377358490566035,2.0125786163522061,9.2503144654088096,397.5,28.77,347.05,13.68,8.0000000000000071,36.77000000000001,33.093000000000011,15.048,349.35899999999998]
["D (extreme)",36,90,12,30,4,83.104402515723265,4.7547169811320753,7.242767295597484,4.8981132075471754,12.140880503144659,397.5,28.79,330.34,18.899999999999999,19.470000000000006,48.260000000000005,43.434000000000005,20.79,333.27600000000001]
["D (extreme)",36,90,18,45,4,78.06037735849057,6.9635220125786157,7.2477987421383645,7.7283018867924511,14.976100628930816,397.5,28.81,310.29000000000002,27.68,30.719999999999978,59.529999999999973,53.576999999999977,30.448,313.47500000000002]

{"sheet":"All_Graphs","index":3,"n_rows":0,"n_cols":0,"rows_kept":0,"cut":false,"hidden":true,"merged":[]}

{"sheet":"Soil Group A","index":4,"n_rows":72,"n_cols":11,"rows_kept":72,"cut":false,"hidden":true,"merged":[]}
[]
["Soil Type","Profile Depth","Profile Depth","Depth of IWS","Depth of IWS","Run-on Ratio","% Drainage","% Runoff","% Evap","% Exfiltration","% Evap + Exf"]
["A",9,23,"NO IWS","NO IWS",0,16.833863469537555,0.81559416034581189,23.456488051545549,58.894054318571079,82.350542370116628]
["A",12,30,"NO IWS","NO IWS",0,17.103009542451673,0.23652230650028544,23.44833210994209,59.21213604110595,82.660468151048036]
["A",18,45,"NO IWS","NO IWS",0,16.988826360003259,0,23.44833210994209,59.562841530054655,83.011173639996741]
["A",18,45,3,7.5,0,8.6860778076828957,0,23.44833210994209,67.865590082375022,91.313922192317108]
["A",18,45,6,15,0,2.8301117363999673,0,23.44833210994209,73.721556153657943,97.169888263600029]
["A",24,60,"NO IWS","NO IWS",0,16.89911100236522,0,23.44833210994209,59.652556887692697,83.100888997634783]
["A",24,60,3,7.5,0,6.6634042900252819,0,23.44833210994209,69.88826360003263,93.336595709974716]
["A",24,60,6,15,0,2.7730201451757601,0,23.44833210994209,73.77864774488215,97.226979854824236]
["A",24,60,12,30,0,0.45673272979365465,0,23.44833210994209,76.094935160264257,99.543267270206343]
["A",36,90,"NO IWS","NO IWS",0,16.996982301606717,0,23.44833210994209,59.554685588451193,83.003017698393279]
["A",36,90,3,7.5,0,8.6942337492863544,0,23.44833210994209,67.857434140771559,91.305766250713646]
["A",36,90,6,15,0,2.8382676780034251,0,23.44833210994209,73.713400212054495,97.161732321996581]
["A",36,90,12,30,0,0.52198026262131969,0,23.44833210994209,76.029687627436587,99.478019737378673]
["A",36,90,18,45,0,3.2623766413832481E-2,0,23.44833210994209,76.519044123644079,99.967376233586165]
["A",9,23,"NO IWS","NO IWS",0.5,20.830157300256392,1.5730025639248839,19.929318827524082,57.667521308294639,77.596840135818724]
["A",12,30,"NO IWS","NO IWS",0.5,21.238999376342594,0.6929526713325479,19.922389300810757,58.145658651514104,78.068047952324861]
["A",18,45,"NO IWS","NO IWS",0.5,21.259787956482569,4.8506686993278363E-2,19.922389300810757,58.769316055713396,78.691705356524153]
["A",18,45,3,7.5,0.5,12.237544175732799,4.8506686993278363E-2,19.922389300810757,67.791559836463165,87.713949137273914]
["A",18,45,6,15,0.5,4.6912895849213498,4.8506686993278363E-2,19.922389300810757,75.337814427274623,95.260203728085372]
["A",24,60,"NO IWS","NO IWS",0.5,21.183563162635991,0,19.922389300810757,58.894047536553252,78.816436837364009]
["A",24,60,3,7.5,0.5,9.8052802993555535,0,19.922389300810757,70.272330399833692,90.194719700644441]
["A",24,60,6,15,0.5,4.6081352643614446,0,19.922389300810757,75.469475434827785,95.391864735638535]
["A",24,60,12,30,0.5,0.75531841175247738,0,19.922389300810757,79.322292287436767,99.244681588247516]
["A",36,90,"NO IWS","NO IWS",0.5,21.273647009909222,0,19.922389300810757,58.803963689280017,78.726352990090774]
["A",36,90,3,7.5,0.5,12.244473702446124,0,19.922389300810757,67.833136996743121,87.755526297553871]
["A",36,90,6,15,0.5,4.6497124246413968,0,19.922389300810757,75.427898274547857,95.350287575358607]
["A",36,90,12,30,0.5,0.80382509874575547,0,19.922389300810757,79.273785600443489,99.196174901254238]
["A",36,90,18,45,0.5,0.13859053426650961,0,19.922389300810757,79.939020164922738,99.861409465733487]
["A",9,23,"NO IWS","NO IWS",1,25.797872340425538,3.1471631205673756,15.940824468085108,55.114140070921977,71.054964539007088]
["A",12,30,"NO IWS","NO IWS",1,26.512632978723406,1.6677748226950353,15.935283687943263,55.884308510638299,71.81959219858156]
["A",18,45,"NO IWS","NO IWS",1,26.723182624113473,0.4598847517730496,15.929742907801419,56.887189716312058,72.816932624113477]
["A",18,45,3,7.5,1,17.425753546099291,0.43218085106382981,15.929742907801419,66.212322695035454,82.14206560283688]
["A",18,45,6,15,1,7.7958776595744688,0.43218085106382981,15.929742907801419,75.842198581560268,91.771941489361694]
["A",24,60,"NO IWS","NO IWS",1,26.750886524822697,5.540780141843972E-2,15.929742907801419,57.263962765957437,73.193705673758856]
["A",24,60,3,7.5,1,14.683067375886525,4.9867021276595744E-2,15.929742907801419,69.337322695035454,85.26706560283688]
["A",24,60,6,15,1,7.7515514184397176,4.4326241134751775E-2,15.929742907801419,76.274379432624102,92.204122340425528]
["A",24,60,12,30,1,1.5458776595744681,8.3111702127659573E-2,15.929742907801419,82.441267730496463,98.371010638297889]
["A",36,90,"NO IWS","NO IWS",1,26.839539007092199,0,15.929742907801419,57.230718085106382,73.160460992907801]
["A",36,90,3,7.5,1,17.50886524822695,0,15.929742907801419,66.56139184397162,82.491134751773046]
["A",36,90,6,15,1,7.8069592198581557,0,15.929742907801419,76.263297872340416,92.193040780141843]
["A",36,90,12,30,1,1.6012854609929079,0,15.929742907801419,82.468971631205676,98.398714539007102]
["A",36,90,18,45,1,0.46542553191489361,0,15.929742907801419,83.604831560283685,99.534574468085111]
["A",9,23,"NO IWS","NO IWS",2,31.124911003876278,7.5310497587216201,11.395459219998418,49.948580017403685,61.3440392374021]
["A",12,30,"NO IWS","NO IWS",2,32.683332014872242,4.2718139387706673,11.375682303615221,51.669171742741874,63.044854046357095]
["A",18,45,"NO IWS","NO IWS",2,33.403211771220633,1.7522347915513012,11.375682303615221,53.468871133612836,64.844553437228058]
["A",18,45,3,7.5,2,24.879360810062494,1.6929040424017088,11.375682303615221,62.052052843920578,73.427735147535799]
["A",18,45,6,15,2,13.31777549244522,1.6612609761885926,11.375682303615221,73.645281227750971,85.020963531366192]
["A",24,60,"NO IWS","NO IWS",2,33.597025551775964,0.80689818843445937,11.371726920338581,54.224349339450988,65.596076259789569]
["A",24,60,3,7.5,2,22.169923265564435,0.77129973894470372,11.371726920338581,65.687050075152285,77.058776995490859]
["A",24,60,6,15,2,13.385017008148093,0.7594335891147852,11.371726920338581,74.483822482398523,85.855549402737097]
["A",24,60,12,30,2,3.4846926667194058,0.81085357171109873,11.371726920338581,84.332726841230908,95.704453761569482]
["A",36,90,"NO IWS","NO IWS",2,33.826437781821056,7.1196898979511106E-2,11.371726920338581,54.730638398860854,66.102365319199436]
["A",36,90,3,7.5,2,25.247211454789969,7.1196898979511106E-2,11.371726920338581,63.309864725891934,74.681591646230515]
["A",36,90,6,15,2,13.574875405426786,7.1196898979511106E-2,11.371726920338581,74.982200775255137,86.353927695593711]
["A",36,90,12,30,2,3.6310418479550668,6.7241515702871624E-2,11.371726920338581,84.92998971600349,96.301716636342064]
["A",36,90,18,45,2,1.0877304010758644,9.492919863934815E-2,11.371726920338581,87.445613479946218,98.817340400284792]
["A",9,23,"NO IWS","NO IWS",4,33.381132075471697,17.685534591194969,7.252830188679245,41.680503144654089,48.933333333333337]
["A",12,30,"NO IWS","NO IWS",4,36.040251572327044,11.771069182389937,7.2477987421383645,44.940880503144655,52.188679245283019]
["A",18,45,"NO IWS","NO IWS",4,38.115723270440249,5.534591194968554,7.2377358490566035,49.11194968553459,56.349685534591195]
["A",18,45,3,7.5,4,31.582389937106921,5.4062893081760999,7.2402515723270442,55.77106918238993,63.011320754716976]
["A",18,45,6,15,4,20.27421383647799,5.3886792452830194,7.2377358490566035,67.099371069182382,74.337106918238987]
["A",24,60,"NO IWS","NO IWS",4,38.759748427672953,3.0842767295597486,7.2352201257861637,50.920754716981136,58.1559748427673]
["A",24,60,3,7.5,4,29.761006289308174,2.9886792452830191,7.2352201257861637,60.015094339622642,67.250314465408806]
["A",24,60,6,15,4,20.747169811320752,2.9735849056603776,7.2352201257861637,69.04402515723271,76.279245283018867]
["A",24,60,12,30,4,7.6981132075471708,3.0540880503144652,7.2352201257861637,82.012578616352215,89.247798742138372]
["A",36,90,"NO IWS","NO IWS",4,39.227672955974846,1.1949685534591197,7.232704402515723,52.344654088050312,59.577358490566034]
["A",36,90,3,7.5,4,32.621383647798737,1.1773584905660377,7.232704402515723,58.968553459119505,66.201257861635227]
["A",36,90,6,15,4,21.162264150943397,1.1698113207547169,7.232704402515723,70.435220125786159,77.667924528301882]
["A",36,90,12,30,4,8.1308176100628931,1.1874213836477987,7.232704402515723,83.449056603773585,90.681761006289307]
["A",36,90,18,45,4,3.152201257861635,1.1874213836477987,7.232704402515723,88.427672955974842,95.660377358490564]

{"sheet":"Soil Group B","index":5,"n_rows":72,"n_cols":11,"rows_kept":72,"cut":false,"hidden":true,"merged":[]}
[]
["Soil Type","Profile Depth","Profile Depth","Depth of IWS","Depth of IWS","Run-on Ratio","% Drainage","% Runoff","% Evap","% Exfiltration","% Evap + Exf"]
["B",9,23,"NO IWS","NO IWS",0,55.770328684446611,1.3865100725878801,23.472799934752466,19.370361308213042,42.843161242965508]
["B",12,30,"NO IWS","NO IWS",0,56.455427779137089,0.62800750346627521,23.44833210994209,19.468232607454542,42.916564717396632]
["B",18,45,"NO IWS","NO IWS",0,56.700106027240835,2.446782481037435E-2,23.44833210994209,19.827094038006702,43.275426147948792]
["B",18,45,3,7.5,0,35.731180164750022,4.89356496207487E-2,23.44833210994209,40.771552075687154,64.21988418562924]
["B",18,45,6,15,0,17.086697659244756,5.7091591224206831E-2,23.44833210994209,59.407878639588958,82.856210749531044]
["B",24,60,"NO IWS","NO IWS",0,56.618546611206256,0,23.44833210994209,19.933121278851655,43.381453388793744]
["B",24,60,3,7.5,0,35.608841040698138,0,23.44833210994209,40.942826849359776,64.391158959301862]
["B",24,60,6,15,0,16.874643177554844,0,23.44833210994209,59.677024712503069,83.125356822445156]
["B",24,60,12,30,0,3.0911018677106266,0,23.44833210994209,73.460566022347294,96.90889813228938]
["B",36,90,"NO IWS","NO IWS",0,56.797977326482339,0,23.44833210994209,19.753690563575571,43.202022673517661]
["B",36,90,3,7.5,0,35.755647989560394,0,23.44833210994209,40.796019900497512,64.244352010439599]
["B",36,90,6,15,0,16.996982301606717,0,23.44833210994209,59.554685588451193,83.003017698393279]
["B",36,90,12,30,0,3.1400375173313755,0,23.44833210994209,73.411630372726535,96.859962482668621]
["B",36,90,18,45,0,0.84821792675964447,0,23.44833210994209,75.703449963298269,99.151782073240355]
["B",9,23,"NO IWS","NO IWS",0.5,59.850322222992169,2.4253343496639177,19.957036934377381,17.767306492966529,37.724343427343911]
["B",12,30,"NO IWS","NO IWS",0.5,60.924398863557613,1.240385281685261,19.929318827524082,17.905897027233042,37.835215854757124]
["B",18,45,"NO IWS","NO IWS",0.5,61.499549580763635,0.28411059524634469,19.922389300810757,18.293950523179262,38.216339823990019]
["B",18,45,3,7.5,0.5,42.415633012265261,0.31182870209964658,19.922389300810757,37.350148984824337,57.272538285635093]
["B",18,45,6,15,0.5,23.144619222507103,0.33954680895294848,19.922389300810757,56.593444667729194,76.515833968539951]
["B",24,60,"NO IWS","NO IWS",0.5,61.62428106160349,6.9295267133254804E-3,19.922389300810757,18.446400110872425,38.368789411683181]
["B",24,60,3,7.5,0.5,42.498787332825167,1.3859053426650961E-2,19.922389300810757,37.564964312937427,57.487353613748184]
["B",24,60,6,15,0.5,23.082253482087175,2.0788580139976438E-2,19.922389300810757,56.974568636962097,76.896957937772854]
["B",24,60,12,30,0.5,5.3495946226872704,6.9295267133254804E-2,19.922389300810757,74.658720809368702,94.581110110179452]
["B",36,90,"NO IWS","NO IWS",0.5,61.79058970272331,0,19.922389300810757,18.287020996465934,38.20941029727669]
["B",36,90,3,7.5,0.5,42.637377867091679,0,19.922389300810757,37.440232832097564,57.362622132908321]
["B",36,90,6,15,0.5,23.206984962927031,0,19.922389300810757,56.870625736262205,76.793015037072962]
["B",36,90,12,30,0.5,5.3357355692606196,0,19.922389300810757,74.741875129928616,94.664264430739365]
["B",36,90,18,45,0.5,1.7323816783313701,0,19.922389300810757,78.345229020857886,98.267618321668635]
["B",9,23,"NO IWS","NO IWS",1,63.558289007092192,4.7595301418439719,15.97406914893617,15.708111702127667,31.682180851063837]
["B",12,30,"NO IWS","NO IWS",1,65.530806737588648,2.5875443262411348,15.946365248226952,15.935283687943263,31.881648936170215]
["B",18,45,"NO IWS","NO IWS",1,66.644503546099301,1.0472074468085106,15.929742907801419,16.378546099290766,32.308289007092185]
["B",18,45,3,7.5,1,50.265957446808521,1.0749113475177305,15.929742907801419,32.729388297872326,48.659131205673745]
["B",18,45,6,15,1,31.011746453900713,1.1358599290780143,15.929742907801419,51.922650709219859,67.852393617021278]
["B",24,60,"NO IWS","NO IWS",1,67.14317375886526,0.3379875886524823,15.929742907801419,16.58909574468084,32.518838652482259]
["B",24,60,3,7.5,1,50.69813829787234,0.3656914893617022,15.929742907801419,33.006427304964539,48.936170212765958]
["B",24,60,6,15,1,31.272163120567377,0.4044769503546099,15.929742907801419,52.393617021276604,68.323359929078023]
["B",24,60,12,30,1,9.3417553191489375,0.54853723404255317,15.929742907801419,74.179964539007074,90.1097074468085]
["B",36,90,"NO IWS","NO IWS",1,67.525487588652481,0,15.929742907801419,16.5447695035461,32.474512411347519]
["B",36,90,3,7.5,1,51.085992907801426,0,15.929742907801419,32.984264184397155,48.914007092198574]
["B",36,90,6,15,1,31.665558510638299,0,15.929742907801419,52.404698581560275,68.334441489361694]
["B",36,90,12,30,1,9.696365248226952,1.6622340425531915E-2,15.929742907801419,74.357269503546092,90.287012411347519]
["B",36,90,18,45,1,3.4463652482269507,1.6622340425531915E-2,15.929742907801419,80.607269503546092,96.537012411347519]
["B",9,23,"NO IWS","NO IWS",2,64.717981172375602,10.98409935922791,11.407325369828335,12.890594098568151,24.297919468396486]
["B",12,30,"NO IWS","NO IWS",2,68.669409065738478,6.5698916224982193,11.399414603275059,13.361284708488245,24.760699311763304]
["B",18,45,"NO IWS","NO IWS",2,71.628035756664815,2.9348943912665137,11.3835930701685,14.053476781900171,25.437069852068671]
["B",18,45,3,7.5,2,58.95498773831185,2.9981805236927461,11.3835930701685,26.663238667826903,38.046831737995404]
["B",18,45,6,15,2,42.010125781188194,3.1603512380349654,11.3835930701685,43.445929910608342,54.829522980776844]
["B",24,60,"NO IWS","NO IWS",2,72.624792342377987,1.6296179099754768,11.371726920338581,14.373862827307956,25.745589747646537]
["B",24,60,3,7.5,2,59.920101257811886,1.6573055929119533,11.371726920338581,27.050866228937579,38.42259314927616]
["B",24,60,6,15,2,42.836800886005854,1.7087255755082669,11.375682303615221,44.078791234870657,55.454473538485878]
["B",24,60,12,30,2,17.937663159560163,1.9935131714263112,11.375682303615221,68.693141365398304,80.068823669013526]
["B",36,90,"NO IWS","NO IWS",2,73.585950478601376,0.45486907681354322,11.371726920338581,14.587453524246499,25.95918044458508]
["B",36,90,3,7.5,2,60.873348627482002,0.47069060992010125,11.371726920338581,27.284233842259319,38.6559607625979]
["B",36,90,6,15,2,43.805869788782537,0.51024444268649638,11.371726920338581,44.312158848192382,55.683885768530963]
["B",36,90,12,30,2,18.835535163357328,0.62099517443240249,11.371726920338581,69.171742741871697,80.543469662210271]
["B",36,90,18,45,2,8.0136065184716401,0.71592437307175061,11.371726920338581,79.898742188118035,91.270469108456609]
["B",9,23,"NO IWS","NO IWS",4,59.119496855345908,23.954716981132076,7.2779874213836475,9.6477987421383684,16.925786163522016]
["B",12,30,"NO IWS","NO IWS",4,65.285534591194974,17.001257861635217,7.2578616352201264,10.455345911949681,17.713207547169809]
["B",18,45,"NO IWS","NO IWS",4,71.879245283018875,9.1044025157232706,7.2477987421383645,11.768553459119488,19.016352201257853]
["B",18,45,3,7.5,4,63.212578616352197,9.2654088050314449,7.2477987421383645,20.274213836477994,27.522012578616359]
["B",18,45,6,15,4,49.866666666666667,9.8314465408805027,7.2503144654088052,33.051572327044028,40.301886792452834]
["B",24,60,"NO IWS","NO IWS",4,74.79245283018868,5.4213836477987423,7.2402515723270442,12.545911949685536,19.786163522012579]
["B",24,60,3,7.5,4,66.153459119496844,5.5069182389937108,7.2402515723270442,21.0993710691824,28.339622641509443]
["B",24,60,6,15,4,52.928301886792454,5.7660377358490571,7.2402515723270442,34.065408805031446,41.305660377358492]
["B",24,60,12,30,4,29.428930817610066,6.7295597484276728,7.242767295597484,56.598742138364777,63.841509433962258]
["B",36,90,"NO IWS","NO IWS",4,77.04402515723271,2.4578616352201257,7.2352201257861637,13.262893081761,20.498113207547163]
["B",36,90,3,7.5,4,68.445283018867926,2.4880503144654087,7.2377358490566035,21.828930817610065,29.06666666666667]
["B",36,90,6,15,4,55.368553459119497,2.561006289308176,7.2352201257861637,34.835220125786165,42.070440251572329]
["B",36,90,12,30,4,32.266666666666666,2.7396226415094338,7.2377358490566035,57.755974842767301,64.993710691823907]
["B",36,90,18,45,4,17.949685534591193,3.0238993710691822,7.2377358490566035,71.788679245283021,79.026415094339626]

{"sheet":"Soil Group C","index":6,"n_rows":72,"n_cols":11,"rows_kept":72,"cut":false,"hidden":true,"merged":[]}
[]
["Soil Type","Profile Depth","Profile Depth","Depth of IWS","Depth of IWS","Run-on Ratio","% Drainage","% Runoff","% Evap","% Exfiltration","% Evap + Exf"]
["C",9,23,"NO IWS","NO IWS",0,69.455998695049331,1.4762254302259197,23.472799934752466,5.5949759399722829,29.067775874724749]
["C",12,30,"NO IWS","NO IWS",0,70.238969088981321,0.70956691950085626,23.44833210994209,5.6031318815757345,29.051463991517824]
["C",18,45,"NO IWS","NO IWS",0,70.785417176413006,4.89356496207487E-2,23.44833210994209,5.7173150640241559,29.165647173966246]
["C",18,45,3,7.5,0,59.130576625071349,8.9715357638039311E-2,23.44833210994209,17.331375907348519,40.779708017290609]
["C",18,45,6,15,0,40.730772367669836,0.16311883206916236,23.44833210994209,35.657776690318912,59.106108800260998]
["C",24,60,"NO IWS","NO IWS",0,70.842508767637213,0,23.44833210994209,5.7091591224206972,29.157491232362787]
["C",24,60,3,7.5,0,59.163200391485191,0,23.44833210994209,17.388467498572719,40.836799608514809]
["C",24,60,6,15,0,40.649212951635263,0,23.44833210994209,35.90245493842265,59.350787048364737]
["C",24,60,12,30,0,14.370769105293208,3.2623766413832481E-2,23.44833210994209,62.148275018350873,85.596607128292959]
["C",36,90,"NO IWS","NO IWS",0,71.038251366120193,0,23.44833210994209,5.5134165239377175,28.961748633879807]
["C",36,90,3,7.5,0,59.367098931571647,0,23.44833210994209,17.184568958486263,40.632901068428353]
["C",36,90,6,15,0,40.804175842100967,0,23.44833210994209,35.747492047956939,59.195824157899025]
["C",36,90,12,30,0,14.321833455672452,0,23.44833210994209,62.229834434385467,85.678166544327553]
["C",36,90,18,45,0,4.5754832395400049,0,23.44833210994209,71.976184650517908,95.424516760459994]
["C",9,23,"NO IWS","NO IWS",0.5,72.420483680964594,2.5777839373570788,19.970895987804031,5.0308363938742957,25.001732381678327]
["C",12,30,"NO IWS","NO IWS",0.5,73.6747280160765,1.3443281823851432,19.929318827524082,5.051624974014274,24.980943801538356]
["C",18,45,"NO IWS","NO IWS",0.5,74.575566488808818,0.33954680895294848,19.922389300810757,5.1624974014274763,25.084886702238233]
["C",18,45,3,7.5,0.5,64.465387014066948,0.42270112951285421,19.922389300810757,15.189522555609443,35.1119118564202]
["C",18,45,6,15,0.5,47.903818169219036,0.60286882405931674,19.922389300810757,31.570923705910893,51.49331300672165]
["C",24,60,"NO IWS","NO IWS",0.5,74.88739519090845,2.7718106853301921E-2,19.922389300810757,5.1624974014274905,25.084886702238247]
["C",24,60,3,7.5,0.5,64.770286189453259,5.5436213706603843E-2,19.922389300810757,15.251888296029378,35.174277596840135]
["C",24,60,6,15,0.5,48.174069711038733,9.7013373986556725E-2,19.922389300810757,31.806527614163954,51.728916914974711]
["C",24,60,12,30,0.5,20.546046705010045,0.332617282239623,19.922389300810757,59.198946711939577,79.121336012750334]
["C",36,90,"NO IWS","NO IWS",0.5,75.088351465594897,0,19.922389300810757,4.9892592335943462,24.911648534405103]
["C",36,90,3,7.5,0.5,64.998960570993006,0,19.922389300810757,15.078650128196237,35.001039429006994]
["C",36,90,6,15,0.5,48.423532672718451,0,19.922389300810757,31.654078026470792,51.576467327281549]
["C",36,90,12,30,0.5,20.740073452983161,0,19.922389300810757,59.337537246206089,79.259926547016846]
["C",36,90,18,45,0.5,8.2461367888573207,0,19.922389300810757,71.831473910331937,91.753863211142686]
["C",9,23,"NO IWS","NO IWS",1,74.67863475177306,5.0365691489361701,15.968528368794328,4.3162677304964419,20.284796099290769]
["C",12,30,"NO IWS","NO IWS",1,76.928191489361708,2.7814716312056738,15.946365248226952,4.3439716312056671,20.290336879432619]
["C",18,45,"NO IWS","NO IWS",1,78.429742907801426,1.1857269503546102,15.929742907801419,4.454787234042545,20.384530141843964]
["C",18,45,3,7.5,1,70.151817375886523,1.2799202127659575,15.935283687943263,12.632978723404255,28.568262411347519]
["C",18,45,6,15,1,55.939716312056746,1.5625,15.935283687943263,26.562499999999993,42.497783687943254]
["C",24,60,"NO IWS","NO IWS",1,79.083554964539005,0.53191489361702127,15.929742907801419,4.4547872340425556,20.384530141843975]
["C",24,60,3,7.5,1,70.877659574468083,0.49867021276595747,15.929742907801419,12.693927304964539,28.623670212765958]
["C",24,60,6,15,1,56.560283687943269,0.74800531914893631,15.929742907801419,26.761968085106375,42.691710992907794]
["C",24,60,12,30,1,30.180629432624112,1.1635638297872342,15.929742907801419,52.726063829787229,68.655806737588648]
["C",36,90,"NO IWS","NO IWS",1,79.72074468085107,0,15.929742907801419,4.3495124113475114,20.27925531914893]
["C",36,90,3,7.5,1,71.481604609929079,1.1081560283687944E-2,15.929742907801419,12.577570921985814,28.507313829787233]
["C",36,90,6,15,1,57.302748226950364,8.3111702127659573E-2,15.929742907801419,26.684397163120558,42.614140070921977]
["C",36,90,12,30,1,31.050531914893618,0.11081560283687944,15.929742907801419,52.90890957446809,68.838652482269509]
["C",36,90,18,45,1,15.325797872340427,0.22163120567375888,15.929742907801419,68.522828014184398,84.452570921985824]
["C",9,23,"NO IWS","NO IWS",2,73.617593544814497,11.589273000553755,11.407325369828335,3.3858080848034131,14.793133454631748]
["C",12,30,"NO IWS","NO IWS",2,78.158373546396646,6.9891622498220087,11.399414603275059,3.4530496005062865,14.852464203781345]
["C",18,45,"NO IWS","NO IWS",2,81.836879993671403,3.1880389209714419,11.37963768689186,3.5954433984652958,14.975081085357155]
["C",18,45,3,7.5,2,75.662526698837112,3.4293173008464524,11.3835930701685,9.5245629301479351,20.908156000316435]
["C",18,45,6,15,2,64.512301241990343,4.0028478759591808,11.3835930701685,20.101257811881979,31.48485088205048]
["C",24,60,"NO IWS","NO IWS",2,83.193576457558748,1.8036547741476148,11.375682303615221,3.6270864646784151,15.002768768293636]
["C",24,60,3,7.5,2,77.133929277747015,1.8946285895103234,11.375682303615221,9.5957598291274415,20.971442132742663]
["C",24,60,6,15,2,66.098409935922803,2.2624792342377975,11.375682303615221,20.263428526224178,31.639110829839399]
["C",24,60,12,30,2,43.283759196266118,3.0733328059488962,11.375682303615221,42.267225694169767,53.642907997784988]
["C",36,90,"NO IWS","NO IWS",2,84.427656039870257,0.61308440787912355,11.37963768689186,3.5796218653587601,14.95925955225062]
["C",36,90,3,7.5,2,78.411518076101586,0.66054900719879761,11.371726920338581,9.5562059963610366,20.927932916699618]
["C",36,90,6,15,2,67.557946365002778,0.81480895498773842,11.37963768689186,20.247606993117621,31.627244680009483]
["C",36,90,12,30,2,45.03994937109406,1.1154180840123409,11.371726920338581,42.472905624555018,53.844632544893599]
["C",36,90,18,45,2,28.197927379163048,1.4990902618463731,11.371726920338581,58.931255438651995,70.302982358990576]
["C",9,23,"NO IWS","NO IWS",4,65.37358490566038,24.943396226415096,7.2855345911949687,2.3974842767295552,9.6830188679245239]
["C",12,30,"NO IWS","NO IWS",4,72.176100628930811,18.037735849056606,7.2628930817610069,2.5232704402515758,9.7861635220125827]
["C",18,45,"NO IWS","NO IWS",4,80.08805031446542,9.9144654088050306,7.2477987421383645,2.749685534591185,9.9974842767295495]
["C",18,45,3,7.5,4,75.713207547169802,10.475471698113207,7.2477987421383645,6.5635220125786269,13.811320754716991]
["C",18,45,6,15,4,67.230188679245288,11.916981132075472,7.2553459119496857,13.597484276729556,20.852830188679242]
["C",24,60,"NO IWS","NO IWS",4,83.791194968553455,6.090566037735849,7.2452830188679247,2.8729559748427711,10.118238993710696]
["C",24,60,3,7.5,4,79.667924528301896,6.3874213836477987,7.2452830188679247,6.6993710691823818,13.944654088050306]
["C",24,60,6,15,4,71.74842767295597,7.1823899371069189,7.2452830188679247,13.823899371069187,21.069182389937112]
["C",24,60,12,30,4,53.265408805031441,9.7534591194968563,7.252830188679245,29.728301886792462,36.981132075471706]
["C",36,90,"NO IWS","NO IWS",4,86.963522012578622,2.8327044025157235,7.2352201257861637,2.9685534591194909,10.203773584905655]
["C",36,90,3,7.5,4,83.04402515723271,2.9207547169811319,7.2352201257861637,6.7999999999999936,14.035220125786157]
["C",36,90,6,15,4,75.677987421383648,3.1371069182389939,7.2377358490566035,13.947169811320753,21.184905660377357]
["C",36,90,12,30,4,58.749685534591201,3.9647798742138365,7.2352201257861637,30.050314465408796,37.28553459119496]
["C",36,90,18,45,4,44.228930817610063,5.0666666666666664,7.2377358490566035,43.466666666666669,50.704402515723274]

{"sheet":"Soil Group D (avg.)","index":7,"n_rows":72,"n_cols":11,"rows_kept":72,"cut":false,"hidden":true,"merged":[]}
[]
["Soil Type","Profile Depth","Profile Depth","Depth of IWS","Depth of IWS","Run-on Ratio","% Drainage","% Runoff","% Evap","% Exfiltration","% Evap + Exf"]
["D (avg.)",9,23,"NO IWS","NO IWS",0,72.40029361389773,1.4925373134328359,23.472799934752466,2.6343691379169663,26.107169072669432]
["D (avg.)",12,30,"NO IWS","NO IWS",0,73.199575891036616,0.71772286110431449,23.456488051545552,2.6262131963135182,26.08270124785907]
["D (avg.)",18,45,"NO IWS","NO IWS",0,73.852051219313267,5.7091591224206845E-2,23.448332109942093,2.642525079520432,26.090857189462525]
["D (avg.)",18,45,3,7.5,0,67.604599951064344,9.7871299241497428E-2,23.448332109942093,8.8491966397520656,32.297528749694159]
["D (avg.)",18,45,6,15,0,55.966071282929619,0.21205448168991112,23.448332109942093,20.373542125438377,43.82187423538047]
["D (avg.)",24,60,"NO IWS","NO IWS",0,73.958078460158234,0,23.448332109942093,2.5935894298996729,26.041921539841766]
["D (avg.)",24,60,3,7.5,0,67.718783133512758,0,23.448332109942093,8.8328847565451483,32.281216866487242]
["D (avg.)",24,60,6,15,0,56.088410406981481,0,23.448332109942093,20.463257483076426,43.911589593018519]
["D (avg.)",24,60,12,30,0,32.387244107332194,8.9715357638039311E-2,23.448332109942093,44.074708425087671,67.523040535029764]
["D (avg.)",36,90,"NO IWS","NO IWS",0,74.16197700024469,0,23.448332109942093,2.3896908898132168,25.83802299975531]
["D (avg.)",36,90,3,7.5,0,67.922681673599214,0,23.448332109942093,8.6289862164586921,32.077318326400786]
["D (avg.)",36,90,6,15,0,56.275997063861027,0,23.448332109942093,20.27567082619688,43.724002936138973]
["D (avg.)",36,90,12,30,0,32.428023815349484,0,23.448332109942093,44.123644074708416,67.571976184650509]
["D (avg.)",36,90,18,45,0,16.246635674088576,0,23.448332109942093,60.305032215969327,83.75336432591142]
["D (avg.)",9,23,"NO IWS","NO IWS",0.5,75.053703832028276,2.5985725174970549,19.970895987804031,2.3768276626706388,22.34772365047467]
["D (avg.)",12,30,"NO IWS","NO IWS",0.5,76.335666273993482,1.3581872358117939,19.929318827524082,2.3768276626706424,22.306146490194724]
["D (avg.)",18,45,"NO IWS","NO IWS",0.5,77.333518120712355,0.35340586237959948,19.922389300810757,2.3906867160972887,22.313076016908045]
["D (avg.)",18,45,3,7.5,0.5,71.928487284318479,0.44348970965283074,19.922389300810757,7.7056337052179344,27.628023006028691]
["D (avg.)",18,45,6,15,0.5,61.693576328736746,0.68602314461922254,19.922389300810757,17.698011225833277,37.620400526644033]
["D (avg.)",24,60,"NO IWS","NO IWS",0.5,77.69385350980528,3.4647633566627402E-2,19.922389300810757,2.3491095558173356,22.271498856628092]
["D (avg.)",24,60,3,7.5,0.5,72.337329360404681,5.5436213706603843E-2,19.922389300810757,7.6848451250779597,27.607234425888716]
["D (avg.)",24,60,6,15,0.5,62.185572725382855,0.13166100755318411,19.922389300810757,17.760376966253205,37.682766267063961]
["D (avg.)",24,60,12,30,0.5,40.302127364700993,0.51971450349941095,19.922389300810757,39.255768830988842,59.178158131799599]
["D (avg.)",36,90,"NO IWS","NO IWS",0.5,77.901739311205048,0,19.922389300810757,2.1758713879841949,22.098260688794952]
["D (avg.)",36,90,3,7.5,0.5,72.566003741944414,0,19.922389300810757,7.5116069572448296,27.433996258055586]
["D (avg.)",36,90,6,15,0.5,62.47661284734253,0,19.922389300810757,17.600997851846714,37.52338715265747]
["D (avg.)",36,90,12,30,0.5,40.738687547640495,0,19.922389300810757,39.338923151548748,59.261312452359505]
["D (avg.)",36,90,18,45,0.5,24.204836809645901,6.9295267133254804E-3,19.922389300810757,55.865844362830025,75.788233663640781]
["D (avg.)",9,23,"NO IWS","NO IWS",1,76.091533687943269,5.9895833333333339,16.046099290780145,1.8727836879432509,17.918882978723396]
["D (avg.)",12,30,"NO IWS","NO IWS",1,78.71786347517731,3.3577127659574471,15.990691489361703,1.9337322695035386,17.924423758865242]
["D (avg.)",18,45,"NO IWS","NO IWS",1,80.479831560283685,1.5791223404255321,15.97406914893617,1.9669769503546135,17.941046099290784]
["D (avg.)",18,45,3,7.5,1,76.401817375886523,1.3131648936170213,15.935283687943263,6.3497340425531927,22.285017730496456]
["D (avg.)",18,45,6,15,1,67.94658687943263,1.6566932624113475,15.935283687943263,14.461436170212759,30.396719858156022]
["D (avg.)",24,60,"NO IWS","NO IWS",1,81.593528368794324,0.43772163120567376,15.929742907801419,2.0390070921985846,17.968750000000004]
["D (avg.)",24,60,3,7.5,1,77.21077127659575,0.52083333333333326,15.929742907801419,6.3386524822694987,22.268395390070918]
["D (avg.)",24,60,6,15,1,68.788785460992912,0.74246453900709231,15.929742907801419,14.539007092198577,30.468749999999996]
["D (avg.)",24,60,12,30,1,49.916888297872347,1.3574911347517733,15.935283687943263,32.790336879432616,48.725620567375877]
["D (avg.)",36,90,"NO IWS","NO IWS",1,81.831781914893625,0.38231382978723405,15.97406914893617,1.8118351063829721,17.785904255319142]
["D (avg.)",36,90,3,7.5,1,77.847960992907801,1.1081560283687944E-2,15.929742907801419,6.2112145390070914,22.14095744680851]
["D (avg.)",36,90,6,15,1,69.586657801418454,6.6489361702127658E-2,15.929742907801419,14.417109929077998,30.346852836879417]
["D (avg.)",36,90,12,30,1,51.080452127659584,0.14406028368794327,15.929742907801419,32.845744680851055,48.775487588652474]
["D (avg.)",36,90,18,45,1,34.862588652482273,0.48758865248226951,15.929742907801419,48.720079787234035,64.649822695035454]
["D (avg.)",9,23,"NO IWS","NO IWS",2,75.346096036705973,11.652559132979986,11.415236136381615,1.5861086939324256,13.001344830314041]
["D (avg.)",12,30,"NO IWS","NO IWS",2,79.962028320544263,7.0247606993117646,11.403369986551697,1.6098409935922753,13.013210980143972]
["D (avg.)",18,45,"NO IWS","NO IWS",2,83.747330116288268,3.2196819871845586,11.37963768689186,1.653350209635315,13.032987896527175]
["D (avg.)",18,45,3,7.5,2,80.3654774147615,3.5202911162091608,11.387548453445138,4.7266830155842001,16.114231469029338]
["D (avg.)",18,45,6,15,2,73.680879677240725,4.2797247053239458,11.387548453445138,10.65184716399019,22.039395617435328]
["D (avg.)",24,60,"NO IWS","NO IWS",2,85.159401946048575,1.827387073807452,11.375682303615221,1.6375286765287509,13.013210980143972]
["D (avg.)",24,60,3,7.5,2,81.951586108693931,1.9420931888299977,11.375682303615221,4.7306383988608509,16.106320702476072]
["D (avg.)",24,60,6,15,2,75.591329799857604,2.3257653666640299,11.37963768689186,10.703267146586507,22.082904833478366]
["D (avg.)",24,60,12,30,2,60.268174986156161,3.6864172138280202,11.37963768689186,24.665770113123955,36.045407800015816]
["D (avg.)",36,90,"NO IWS","NO IWS",2,85.396724942646955,1.7126809587849063,11.442923819318091,1.4476702792500475,12.890594098568139]
["D (avg.)",36,90,3,7.5,2,83.28455027292145,0.68823669013527411,11.371726920338581,4.6554861166046955,16.027213036943277]
["D (avg.)",36,90,6,15,2,77.153706194130208,0.83063048809429629,11.371726920338581,10.643936397436914,22.015663317775495]
["D (avg.)",36,90,12,30,2,62.653271101969786,1.2499011154180841,11.371726920338581,24.72510086227355,36.096827782612131]
["D (avg.)",36,90,18,45,2,49.327584842971284,1.8748516731271263,11.375682303615221,37.42188118028637,48.797563483901591]
["D (avg.)",9,23,"NO IWS","NO IWS",4,66.515723270440247,25.086792452830188,7.2830188679245271,1.114465408805037,8.3974842767295641]
["D (avg.)",12,30,"NO IWS","NO IWS",4,73.4188679245283,18.155974842767296,7.2628930817610069,1.1622641509433969,8.4251572327044038]
["D (avg.)",18,45,"NO IWS","NO IWS",4,81.506918238993705,10.00251572327044,7.2477987421383645,1.2427672955974902,8.4905660377358547]
["D (avg.)",18,45,3,7.5,4,78.835220125786165,10.70943396226415,7.252830188679245,3.20251572327044,10.455345911949685]
["D (avg.)",18,45,6,15,4,73.109433962264163,12.621383647798742,7.2553459119496857,7.0138364779874092,14.269182389937095]
["D (avg.)",24,60,"NO IWS","NO IWS",4,85.31320754716981,6.1660377358490575,7.2477987421383645,1.2729559748427679,8.5207547169811324]
["D (avg.)",24,60,3,7.5,4,82.996226415094341,6.5157232704402519,7.2452830188679247,3.2427672955974831,10.488050314465408]
["D (avg.)",24,60,6,15,4,78.191194968553461,7.4691823899371066,7.2452830188679247,7.0943396226415079,14.339622641509433]
["D (avg.)",24,60,12,30,4,65.288050314465409,11.101886792452831,7.252830188679245,16.357232704402517,23.610062893081761]
["D (avg.)",36,90,"NO IWS","NO IWS",4,88.608805031446551,2.8805031446540879,7.2352201257861637,1.275471698113197,8.5106918238993607]
["D (avg.)",36,90,3,7.5,4,86.515723270440247,3.0037735849056602,7.2352201257861637,3.2452830188679282,10.480503144654092]
["D (avg.)",36,90,6,15,4,82.296855345911951,3.3584905660377355,7.2377358490566035,7.1069182389937104,14.344654088050314]
["D (avg.)",36,90,12,30,4,71.828930817610058,4.4729559748427672,7.242767295597484,16.455345911949689,23.698113207547173]
["D (avg.)",36,90,18,45,4,61.227672955974846,6.2490566037735844,7.2477987421383645,25.275471698113208,32.523270440251572]

{"sheet":"Soil Group D (extreme)","index":8,"n_rows":72,"n_cols":11,"rows_kept":72,"cut":false,"hidden":true,"merged":[]}
[]
["Soil Type","Profile Depth","Profile Depth","Depth of IWS","Depth of IWS","Run-on Ratio","% Drainage","% Runoff","% Evap","% Exfiltration","% Evap + Exf"]
["D (extreme)",9,23,"NO IWS","NO IWS",0,74.153821058641213,1.5006932550362939,23.472799934752466,0.87268575157002815,24.345485686322494]
["D (extreme)",12,30,"NO IWS","NO IWS",0,74.977571160590486,0.72587880270777261,23.456488051545549,0.84006198515619346,24.296550036701742]
["D (extreme)",18,45,"NO IWS","NO IWS",0,75.711605904901703,5.7091591224206831E-2,23.44833210994209,0.78297039393200052,24.23130250387409]
["D (extreme)",18,45,3,7.5,0,73.835739336106357,9.78712992414974E-2,23.44833210994209,2.618057254710056,26.066389364652146]
["D (extreme)",18,45,6,15,0,70.01875866568794,0.23652230650028544,23.44833210994209,6.2963869178696861,29.744719027811776]
["D (extreme)",24,60,"NO IWS","NO IWS",0,75.858412853763966,0,23.44833210994209,0.69325503629394447,24.141587146236034]
["D (extreme)",24,60,3,7.5,0,74.015170051382412,0,23.44833210994209,2.5364978386754977,25.984829948617588]
["D (extreme)",24,60,6,15,0,70.312372563412424,0,23.44833210994209,6.239295326645486,29.687627436587576]
["D (extreme)",24,60,12,30,0,61.169562025935889,0.15496289046570424,23.44833210994209,15.227142973656317,38.675475083598407]
["D (extreme)",36,90,"NO IWS","NO IWS",0,76.062311393850422,0,23.44833210994209,0.48935649620748833,23.937688606149578]
["D (extreme)",36,90,3,7.5,0,74.219068591468869,0,23.44833210994209,2.3325992985890416,25.780931408531131]
["D (extreme)",36,90,6,15,0,70.51627110349888,0,23.44833210994209,6.0353967865590299,29.48372889650112]
["D (extreme)",36,90,12,30,0,61.463175923660387,0,23.44833210994209,15.088491966397523,38.536824076339613]
["D (extreme)",36,90,18,45,0,52.630291167115239,0,23.44833210994209,23.921376722942671,47.369708832884761]
["D (extreme)",9,23,"NO IWS","NO IWS",0.5,76.633635922666485,2.612431570923706,19.970895987804031,0.78303651860577617,20.753932506409807]
["D (extreme)",12,30,"NO IWS","NO IWS",0.5,77.943316471485005,1.3720462892384451,19.929318827524082,0.75531841175246939,20.684637239276551]
["D (extreme)",18,45,"NO IWS","NO IWS",0.5,79.017393112050456,0.36033538909292495,19.922389300810757,0.69988219804586294,20.62227149885662]
["D (extreme)",18,45,3,7.5,0.5,77.354306700852334,0.45734876307948169,19.922389300810757,2.2659552352574295,22.188344536068186]
["D (extreme)",18,45,6,15,0.5,73.94497955789619,0.73452983161250096,19.922389300810757,5.3981013096805519,25.320490610491309]
["D (extreme)",24,60,"NO IWS","NO IWS",0.5,79.412376134710001,3.4647633566627402E-2,19.922389300810757,0.63058693091261375,20.55297623172337]
["D (extreme)",24,60,3,7.5,0.5,77.818584990645135,6.2365740419929316E-2,19.922389300810757,2.1966599681241803,22.119049268934937]
["D (extreme)",24,60,6,15,0.5,74.596355068948796,0.13166100755318411,19.922389300810757,5.3495946226872633,25.27198392349802]
["D (extreme)",24,60,12,30,0.5,66.412584020511403,0.60286882405931674,19.922389300810757,13.062157854618526,32.984547155429283]
["D (extreme)",36,90,"NO IWS","NO IWS",0.5,79.627191462823092,0,19.922389300810757,0.45041923636615167,20.372808537176908]
["D (extreme)",36,90,3,7.5,0.5,78.054188898898204,0,19.922389300810757,2.0234218002910396,21.945811101101796]
["D (extreme)",36,90,6,15,0.5,74.901254244335121,0,19.922389300810757,5.1763564548541225,25.098745755664879]
["D (extreme)",36,90,12,30,0.5,67.119395745270594,0,19.922389300810757,12.958214953918649,32.880604254729406]
["D (extreme)",36,90,18,45,0.5,59.455339200332617,7.6224793846580277E-2,19.922389300810757,20.546046705010049,40.468436005820806]
["D (extreme)",9,23,"NO IWS","NO IWS",1,78.291223404255334,5.0642730496453909,15.97406914893617,0.67043439716310615,16.644503546099276]
["D (extreme)",12,30,"NO IWS","NO IWS",1,80.585106382978722,2.8202570921985819,15.946365248226952,0.64827127659574479,16.594636524822697]
["D (extreme)",18,45,"NO IWS","NO IWS",1,82.252881205673759,1.207890070921986,15.929742907801419,0.60948581560283444,16.539228723404253]
["D (extreme)",18,45,3,7.5,1,80.873226950354621,1.3297872340425532,15.935283687943263,1.861702127659564,17.796985815602827]
["D (extreme)",18,45,6,15,1,77.953235815602838,1.7398049645390072,15.935283687943263,4.3716755319148906,20.306959219858154]
["D (extreme)",24,60,"NO IWS","NO IWS",1,83.072916666666671,0.44880319148936176,15.929742907801419,0.5485372340425485,16.478280141843967]
["D (extreme)",24,60,3,7.5,1,81.726507092198588,0.53745567375886527,15.929742907801419,1.806294326241126,17.736037234042545]
["D (extreme)",24,60,6,15,1,78.983820921985824,0.75354609929078031,15.929742907801419,4.3328900709219766,20.262632978723396]
["D (extreme)",24,60,12,30,1,71.974734042553195,1.5292553191489362,15.935283687943263,10.560726950354605,26.496010638297868]
["D (extreme)",36,90,"NO IWS","NO IWS",1,83.660239361702139,5.5407801418439718E-3,15.929742907801419,0.4044769503545993,16.334219858156018]
["D (extreme)",36,90,3,7.5,1,82.391400709219852,1.1081560283687944E-2,15.929742907801419,1.6677748226950406,17.59751773049646]
["D (extreme)",36,90,6,15,1,79.837101063829792,3.3244680851063829E-2,15.929742907801419,4.1999113475177268,20.129654255319146]
["D (extreme)",36,90,12,30,1,73.431959219858157,0.1773049645390071,15.929742907801419,10.460992907801415,26.390735815602834]
["D (extreme)",36,90,18,45,1,66.843971631205676,0.59840425531914898,15.929742907801419,16.627881205673759,32.557624113475178]
["D (extreme)",9,23,"NO IWS","NO IWS",2,76.406138754845344,11.668380666086545,11.415236136381615,0.5102444426864956,11.925480579068111]
["D (extreme)",12,30,"NO IWS","NO IWS",2,81.057669488173417,7.0366268491416823,11.399414603275059,0.50628905940984126,11.9057036626849]
["D (extreme)",18,45,"NO IWS","NO IWS",2,84.902302033067016,3.2355035202911164,11.37963768689186,0.48255675975000756,11.862194446641867]
["D (extreme)",18,45,3,7.5,2,83.676133217308774,3.5638003322521956,11.3835930701685,1.3764733802705305,12.76006645043903]
["D (extreme)",18,45,6,15,2,80.994383355747175,4.4498061862194449,11.387548453445138,3.168262004588243,14.555810458033381]
["D (extreme)",24,60,"NO IWS","NO IWS",2,86.346016929040431,1.8392532236373704,11.375682303615221,0.43904754370697674,11.814729847322198]
["D (extreme)",24,60,3,7.5,2,85.3215726603908,1.9658254884898345,11.375682303615221,1.3369195475041451,12.712601851119366]
["D (extreme)",24,60,6,15,2,83.118424175302579,2.3574084328771461,11.375682303615221,3.148485088205053,14.524167391820274]
["D (extreme)",24,60,12,30,2,76.908472430978563,4.0700893916620515,11.37963768689186,7.6418004904675261,19.021438177359386]
["D (extreme)",36,90,"NO IWS","NO IWS",2,87.643382643778196,0.64077209081560005,11.371726920338581,0.3441183450676224,11.715845265406204]
["D (extreme)",36,90,3,7.5,2,86.682224507554778,0.70010283996519262,11.371726920338581,1.2459457321414487,12.61767265248003]
["D (extreme)",36,90,6,15,2,84.724309785618217,0.85436278775413343,11.371726920338581,3.0496005062890674,14.421327426627649]
["D (extreme)",36,90,12,30,2,79.677240724626216,1.3764733802705482,11.371726920338581,7.5745589747646562,18.946285895103237]
["D (extreme)",36,90,18,45,2,74.483822482398537,2.1161300530021356,11.375682303615221,12.024365160984107,23.400047464599329]
["D (extreme)",9,23,"NO IWS","NO IWS",4,67.197484276729554,25.162264150943397,7.2830188679245271,0.35723270440252186,7.640251572327049]
["D (extreme)",12,30,"NO IWS","NO IWS",4,74.166037735849059,18.216352201257859,7.2628930817610069,0.35471698113207495,7.6176100628930818]
["D (extreme)",18,45,"NO IWS","NO IWS",4,82.367295597484286,10.027672955974843,7.2503144654088052,0.35471698113206518,7.6050314465408704]
["D (extreme)",18,45,3,7.5,4,80.988679245283024,10.837735849056603,7.252830188679245,0.92075471698112832,8.1735849056603733]
["D (extreme)",18,45,6,15,4,77.56981132075471,13.11194968553459,7.2553459119496857,2.0628930817610147,9.3182389937107004]
["D (extreme)",24,60,"NO IWS","NO IWS",4,86.233962264150932,6.1811320754716981,7.2452830188679247,0.33962264150944499,7.5849056603773697]
["D (extreme)",24,60,3,7.5,4,85.247798742138372,6.596226415094339,7.2452830188679247,0.91069182389936465,8.1559748427672893]
["D (extreme)",24,60,6,15,4,82.991194968553458,7.7031446540880513,7.2452830188679247,2.060377358490566,9.3056603773584907]
["D (extreme)",24,60,12,30,4,75.501886792452837,12.316981132075473,7.252830188679245,4.928301886792446,12.181132075471691]
["D (extreme)",36,90,"NO IWS","NO IWS",4,89.514465408805037,2.9559748427672958,7.2377358490566035,0.29182389937106379,7.5295597484276673]
["D (extreme)",36,90,3,7.5,4,88.807547169811315,3.0918238993710689,7.2377358490566035,0.86289308176101365,8.1006289308176171]
["D (extreme)",36,90,6,15,4,87.308176100628927,3.4415094339622643,7.2377358490566035,2.0125786163522061,9.2503144654088096]
["D (extreme)",36,90,12,30,4,83.104402515723265,4.7547169811320753,7.242767295597484,4.8981132075471754,12.140880503144659]
["D (extreme)",36,90,18,45,4,78.06037735849057,6.9635220125786157,7.2477987421383645,7.7283018867924511,14.976100628930816]