{"text_format":"1","workbook":"xlsx","n_sheets":13,"sheets":["About BRC HyPerTool","BRC HyPerTool","All_Simulations","All_Graphs","A-2ft","A-3ft","B-3ft","B-4ft","C-3ft","C-4ft","D-3ft","D-4ft","D-5ft"],"not_rendered":{"charts":73,"images":4,"macros":1,"external_links":0,"defined_names":27,"comments":1,"pivot_tables":0},"unopened":[],"bounds":{"document_bytes":16777216,"sheet_cells":100000,"rows_first":2000,"rows_last":500,"rows_between":2000,"halvings":0,"cell_chars":16384,"cell_head_chars":4096},"cells_cut":0,"cells_raw":0,"read":"whole","date_system":"1900"}

{"sheet":"About BRC HyPerTool","index":0,"n_rows":65,"n_cols":10,"rows_kept":65,"cut":false,"hidden":false,"merged":[[67,1,67,7],[68,1,68,7],[58,1,60,7],[64,1,66,7],[25,9,25,10],[20,1,26,7],[38,1,41,7],[55,1,57,7],[61,1,63,7],[44,1,46,7],[43,1,43,7],[47,1,49,7],[51,1,51,7],[52,1,54,7],[19,1,19,7],[28,1,28,7],[36,1,36,7],[2,0,2,8],[7,0,7,8],[10,1,17,7],[29,1,34,7],[9,1,9,7],[3,1,3,7],[4,1,4,7],[5,1,5,7],[6,1,6,7]]}
["North Carolina Long-Term Bioretention Hydrologic Performance Tool"]
[]
["LONG-TERM MODELING OF BIORETENTION HYDROLOGY WITH DRAINMOD"]
[null,"Developed by: Drs. Robert A. Brown, William F. Hunt, and R. Wayne Skaggs"]
[null,"Department of Biological and Agricultural Engineering"]
[null,"North Carolina State University, Raleigh, North Carolina"]
[null,"Contact: Dr. William (Bill) F. Hunt, 919-515-6715, bill_hunt@ncsu.edu"]
[" Funded by: Water Resources Research Institute (WRRI) of the University of North Carolina"]
[]
[null,"INTRODUCTION"]
{"$rows_left_out":56}
{"sheet":"BRC HyPerTool","index":1,"n_rows":52,"n_cols":13,"rows_kept":52,"cut":false,"hidden":false,"merged":[[2,12,47,14],[4,2,4,3],[5,2,5,3],[6,2,6,3],[7,2,7,3],[8,2,8,3],[13,2,13,3],[15,2,15,3],[48,5,48,11],[51,5,53,11],[31,2,32,2],[21,2,22,2],[37,0,37,11],[38,0,47,11]]}
["North Carolina Long-Term Bioretention Hydrologic Performance Tool"]
["DESIGN INPUT PARAMETERS",null,null,null,null,null,null,null,null,null,null,null,"NOTES"]
["Units"]
["Hydrologic Soil Group"]
["Soil Media Depth",null,{"$f":"IF(B3=\"SI\",IF(OR(AND(OR(B4=\"C\",B4=\"D\"),B5=0.6),AND(OR(B4=\"A\",B4=\"B\",B4=\"C\"),B5=1.5)),\"PLEASE UPDATE!\",\"m\"),IF(OR(AND(OR(B4=\"C\",B4=\"D\"),B5=2),AND(OR(B4=\"A\",B4=\"B\",B4=\"C\"),B5=5)),\"PLEASE UPDATE!\",\"ft\"))","v":"ft"}]
["Depth to IWS",null,{"$f":"IF(B3=\"SI\",IF(OR(AND(OR(B4=\"D\",B4=\"C\"),B6=30),AND(OR(B4=\"A\",B4=\"B\"),B6=45)),\"PLEASE UPDATE!\",\"cm\"),IF(OR(AND(OR(B4=\"D\",B4=\"C\"),B6=1),AND(OR(B4=\"A\",B4=\"B\"),B6=1.5)),\"PLEASE UPDATE!\",\"ft\"))","v":"ft"}]
["Average Surface Ponding",null,{"$f":"IF(B3=\"SI\",\"cm\",\"in\")","v":"in"}]
["Surface Storage Ratio",null,"relative to WQ volume"]
["Drainage Coefficient",null,{"$f":"IF(AND(OR(B9=1.3,B9=0.6,B9=40,B9=20),B6=\"NO IWS\"),\"PLEASE UPDATE\",IF(B3=\"SI\",\"cm/d\",\"ft/d\"))","v":"ft/d"}]
["BRC Area : Drainage Area Ratio",{"$f":"IF(OR(B7=9,B7=23),(B8*0.11111),IF(OR(B7=12,B7=30),(B8*0.083333),\"\"))","v":""}]
{"$rows_left_out":43}
{"sheet":"All_Simulations","index":2,"n_rows":443,"n_cols":24,"rows_kept":443,"cut":false,"hidden":true,"merged":[[0,8,0,13],[0,6,0,7],[0,16,0,21]]}
["Soil Type","A","B","C","D",null,"1-ac 100% imp. Drainage area",null,"Drain Area Ratio",null,null,null,null,null,null,null,"Variable Selection Lists"]
["Ksat (cm/hr)",3,0.35,0.05,5.0000000000000001E-3,null,"Surf. Stor","Relative to 100%",0.5,0.75,1,1.25,1.5,2,null,null,"Factors of Safety","Units","Media Depth","Ponding","Depth to IWS","DC"]
["Ksat (in/hr)",{"$f":"ROUND(B2/2.54,2)","v":1.18},{"$f":"ROUND(C2/2.54,2)","v":0.14000000000000001},{"$f":"(ROUND(D2/2.54,3))","v":0.02},{"$f":"ROUND(E2/2.54,4)","v":2E-3},12,"30 cm",14,{"$f":"$H$3/I2","v":28},{"$f":"ROUND($H$3/J2,1)","v":18.7},{"$f":"$H$3/K2","v":14},{"$f":"$H$3/L2","v":11.2},{"$f":"ROUND($H$3/M2,1)","v":9.3000000000000007},{"$f":"$H$3/N2","v":7},14,null,"Safety","Units","Media","Ponding","IWS","DC",{"$f":"IF('BRC HyPerTool'!B3=\"SI\",IF(ISNA(IF('BRC HyPerTool'!B7=23,LOOKUP('BRC HyPerTool'!B8,Area_Ratio,All_Simulations!I4:N4),LOOKUP('BRC HyPerTool'!B8,Area_Ratio,All_Simulations!I3:N3))),\"\",(IF('BRC HyPerTool'!B7=23,LOOKUP('BRC HyPerTool'!B8,Area_Ratio,All_Simulations!I4:N4),LOOKUP('BRC HyPerTool'!B8,Area_Ratio,All_Simulations!I3:N3)))),IF(ISNA(IF('BRC HyPerTool'!B7=9,LOOKUP('BRC HyPerTool'!B8,Area_Ratio,All_Simulations!I4:N4),LOOKUP('BRC HyPerTool'!B8,Area_Ratio,All_Simulations!I3:N3))),\"\",(IF('BRC HyPerTool'!B7=9,LOOKUP('BRC HyPerTool'!B8,Area_Ratio,All_Simulations!I4:N4),LOOKUP('BRC HyPerTool'!B8,Area_Ratio,All_Simulations!I3:N3)))))","v":""}]
[null,null,null,null,null,9,"23 cm",10.199999999999999,{"$f":"$H$4/I2","v":20.399999999999999},13.6,10.199999999999999,{"$f":"ROUND($H$4/L2,1)","v":8.1999999999999993},6.8,5.0999999999999996,10.199999999999999,null,"NONE","SI",{"$f":"IF('BRC HyPerTool'!B3=\"SI\",(IF('BRC HyPerTool'!B4=\"A\",0.6,0.9)),(IF('BRC HyPerTool'!B4=\"A\",2,3)))","v":3},{"$f":"IF('BRC HyPerTool'!B3=\"SI\",23,9)","v":9},"NO IWS",{"$f":"IF('BRC HyPerTool'!B3=\"SI\",60,2)","v":2}]
[null,null,null,null,null,null,null,null,null,null,null,null,null,null,null,null,0.1,"English",{"$f":"IF('BRC HyPerTool'!B3=\"SI\",IF(S4=0.6,0.9,1.2),IF(S4=2,3,4))","v":4},{"$f":"IF('BRC HyPerTool'!B3=\"SI\",30,12)","v":12},{"$f":"IF('BRC HyPerTool'!B3=\"SI\",IF(OR('BRC HyPerTool'!B4=\"A\",'BRC HyPerTool'!B4=\"B\"),30,45),IF(OR('BRC HyPerTool'!B4=\"A\",'BRC HyPerTool'!B4=\"B\"),1,1.5))","v":1.5},{"$f":"IF('BRC HyPerTool'!B3=\"SI\",IF('BRC HyPerTool'!B6=\"NO IWS\",\"\",40),IF('BRC HyPerTool'!B6=\"NO IWS\",\"\",1.3))","v":1.3}]
[null,null,null,null,null,null,null,null,null,null,null,null,null,null,null,null,null,null,{"$f":"IF('BRC HyPerTool'!B3=\"SI\",IF('BRC HyPerTool'!B4=\"D\",1.5,\"\"),IF('BRC HyPerTool'!B4=\"D\",5,\"\"))","v":""},null,null,{"$f":"IF('BRC HyPerTool'!B3=\"SI\",IF('BRC HyPerTool'!B6=\"NO IWS\",\"\",20),IF('BRC HyPerTool'!B6=\"NO IWS\",\"\",0.6))","v":0.6}]
[]
[]
[null,null,null,null,null,null,"A & B - 1 ft","A & B - 30 cm",null,"Conv - 60"]
["A,B,C, or D","2, 3, 4, or 5 ft","m","9 or 12 in","23 or 30 cm",null,"C & D - 1.5 ft","C & D 45 cm",null,"IWS - 60,40,20","Runoff","ET",null,"Drainage",null,"Overflow",null,"Exfiltration"]
{"$rows_left_out":434}
{"sheet":"All_Graphs","index":3,"n_rows":12,"n_cols":1,"rows_kept":12,"cut":false,"hidden":true,"merged":[]}
[]
[]
[]
[]
[]
[]
[]
[]
[]
[]
{"$rows_left_out":3}
{"sheet":"A-2ft","index":4,"n_rows":50,"n_cols":16,"rows_kept":50,"cut":false,"hidden":true,"merged":[]}
[null,null,null,null,null,null,null,"Runoff","ET","Drainage","Overflow","Exfiltration"]
["Soil Type","Media Depth","Surf Storage","Area Ratio","Top of IWS","DC","Area Ratio","Rainfall","ET","Drainage","Runoff","VertSeepage","ET","Drainage","Overflow","Exfiltration"]
["A",2,30,28,"none",60,0.5,2734,100,1055,651,927,{"$f":"I3/H3","v":3.6576444769568395E-2},{"$f":"J3/H3","v":0.38588149231894658},{"$f":"K3/H3","v":0.23811265544989027},{"$f":"L3/H3","v":0.33906364301389907}]
["A",2,30,28,30,60,0.5,2734,100,0,651,1984,3.6576444769568395E-2,0,0.23811265544989027,0.72567666422823707]
["A",2,30,28,30,40,0.5,2734,100,0,651,1984,3.6576444769568395E-2,0,0.23811265544989027,0.72567666422823707]
["A",2,30,28,30,20,0.5,2734,100,0,651,1984,3.6576444769568395E-2,0,0.23811265544989027,0.72567666422823707]
["A",2,30,18.7,"none",60,0.75,1861,100,781,233,747,5.3734551316496508E-2,0.41966684578183772,0.12520150456743687,0.40139709833422893]
["A",2,30,18.7,30,60,0.75,1861,100,0,233,1529,5.3734551316496508E-2,0,0.12520150456743687,0.82160128962923162]
["A",2,30,18.7,30,40,0.75,1861,100,0,233,1529,5.3734551316496508E-2,0,0.12520150456743687,0.82160128962923162]
["A",2,30,18.7,30,20,0.75,1861,100,0,233,1529,5.3734551316496508E-2,0,0.12520150456743687,0.82160128962923162]
{"$rows_left_out":41}
{"sheet":"A-3ft","index":5,"n_rows":50,"n_cols":16,"rows_kept":50,"cut":false,"hidden":true,"merged":[]}
[null,null,null,null,null,null,null,"Runoff","ET","Drainage","Overflow","Exfiltration"]
["Soil Type","Media Depth","Surf Storage","Area Ratio","Top of IWS","DC","Area Ratio","Rainfall","ET","Drainage","Runoff","VertSeepage","ET","Drainage","Overflow","Exfiltration"]
["A",3,30,28,"none",60,0.5,2734,100,1095,636,902,{"$f":"I3/H3","v":3.6576444769568395E-2},{"$f":"J3/H3","v":0.40051207022677393},{"$f":"K3/H3","v":0.23262618873445501},{"$f":"L3/H3","v":0.32991953182150696}]
["A",3,30,28,30,60,0.5,2734,100,0,633,2004,3.6576444769568395E-2,0,0.23152889539136795,0.73299195318215071]
["A",3,30,28,30,40,0.5,2734,100,0,633,2004,3.6576444769568395E-2,0,0.23152889539136795,0.73299195318215071]
["A",3,30,28,30,20,0.5,2734,100,0,633,2004,3.6576444769568395E-2,0,0.23152889539136795,0.73299195318215071]
["A",3,30,18.7,"none",60,0.75,1861,100,813,226,722,5.3734551316496508E-2,0.4368619022031166,0.12144008597528211,0.38796346050510477]
["A",3,30,18.7,30,60,0.75,1861,100,0,224,1539,5.3734551316496508E-2,0,0.12036539494895218,0.82697474476088129]
["A",3,30,18.7,30,40,0.75,1861,100,0,224,1539,5.3734551316496508E-2,0,0.12036539494895218,0.82697474476088129]
["A",3,30,18.7,30,20,0.75,1861,100,0,224,1539,5.3734551316496508E-2,0,0.12036539494895218,0.82697474476088129]
{"$rows_left_out":41}
{"sheet":"B-3ft","index":6,"n_rows":50,"n_cols":16,"rows_kept":50,"cut":false,"hidden":true,"merged":[]}
[null,null,null,null,null,null,null,"Runoff","ET","Drainage","Overflow","Exfiltration"]
["Soil Type","Media Depth","Surf Storage","Area Ratio","Top of IWS","DC","Area Ratio","Rainfall","ET","Drainage","Runoff","VertSeepage","ET","Drainage","Overflow","Exfiltration"]
["B",3,30,28,"none",60,0.5,2734,100,1788,637,208,{"$f":"I3/H3","v":3.6576444769568395E-2},{"$f":"J3/H3","v":0.65398683247988298},{"$f":"K3/H3","v":0.23299195318215069},{"$f":"L3/H3","v":7.6079005120702273E-2}]
["B",3,30,28,30,60,0.5,2734,100,875,634,1124,3.6576444769568395E-2,0.3200438917337235,0.23189465983906365,0.41111923920994881]
["B",3,30,28,30,40,0.5,2734,100,746,695,1192,3.6576444769568395E-2,0.27286027798098023,0.25420629114850035,0.43599122165325532]
["B",3,30,28,30,20,0.5,2734,100,565,751,1317,3.6576444769568395E-2,0.20665691294806146,0.27468910021945869,0.48171177761521577]
["B",3,30,18.7,"none",60,0.75,1861,100,1358,226,177,5.3734551316496508E-2,0.7297152068780226,0.12144008597528211,9.5110155830198814E-2]
["B",3,30,18.7,30,60,0.75,1861,100,578,222,961,5.3734551316496508E-2,0.31058570660934981,0.11929070392262224,0.51638903815153148]
["B",3,30,18.7,30,40,0.75,1861,100,505,251,1006,5.3734551316496508E-2,0.27135948414830735,0.13487372380440624,0.5405695862439549]
["B",3,30,18.7,30,20,0.75,1861,100,387,278,1097,5.3734551316496508E-2,0.20795271359484149,0.14938205265986029,0.58946802794196673]
{"$rows_left_out":41}
{"sheet":"B-4ft","index":7,"n_rows":50,"n_cols":16,"rows_kept":50,"cut":false,"hidden":true,"merged":[]}
[null,null,null,null,null,null,null,"Runoff","ET","Drainage","Overflow","Exfiltration"]
["Soil Type","Media Depth","Surf Storage","Area Ratio","Top of IWS","DC","Area Ratio","Rainfall","ET","Drainage","Runoff","VertSeepage","ET","Drainage","Overflow","Exfiltration"]
["B",4,30,28,"none",60,0.5,2734,101,1778,619,237,{"$f":"I3/H3","v":3.6942209217264085E-2},{"$f":"J3/H3","v":0.65032918800292616},{"$f":"K3/H3","v":0.22640819312362839},{"$f":"L3/H3","v":8.6686174103877106E-2}]
["B",4,30,28,30,60,0.5,2734,101,652,624,1357,3.6942209217264085E-2,0.23847841989758595,0.2282370153621068,0.49634235552304318]
["B",4,30,28,30,40,0.5,2734,101,547,666,1420,3.6942209217264085E-2,0.20007315288953914,0.24359912216532553,0.51938551572787128]
["B",4,30,28,30,20,0.5,2734,101,412,697,1525,3.6942209217264085E-2,0.15069495245062181,0.25493782004389176,0.55779078273591809]
["B",4,30,18.7,"none",60,0.75,1861,101,1341,217,202,5.4271896829661471E-2,0.72058033315421821,0.11660397635679742,0.10854379365932294]
["B",4,30,18.7,30,60,0.75,1861,101,413,215,1133,5.4271896829661471E-2,0.22192369693713057,0.1155292853304675,0.60881246641590547]
["B",4,30,18.7,30,40,0.75,1861,101,353,235,1173,5.4271896829661471E-2,0.18968296614723268,0.12627619559376679,0.63030628694250401]
["B",4,30,18.7,30,20,0.75,1861,101,266,251,1244,5.4271896829661471E-2,0.1429339065018807,0.13487372380440624,0.66845781837721652]
{"$rows_left_out":41}
{"sheet":"C-3ft","index":8,"n_rows":50,"n_cols":16,"rows_kept":50,"cut":false,"hidden":true,"merged":[]}
[null,null,null,null,null,null,null,"Runoff","ET","Drainage","Overflow","Exfiltration"]
["Soil Type","Media Depth","Surf Storage","Area Ratio","Top of IWS","DC","Area Ratio","Rainfall","ET","Drainage","Runoff","VertSeepage","ET","Drainage","Overflow","Exfiltration"]
["C",3,30,28,"none",60,0.5,2734,100,1952,638,44,{"$f":"I3/H3","v":3.6576444769568395E-2},{"$f":"J3/H3","v":0.71397220190197508},{"$f":"K3/H3","v":0.23335771762984639},{"$f":"L3/H3","v":1.6093635698610095E-2}]
["C",3,30,28,45,60,0.5,2734,100,1594,680,359,3.6576444769568395E-2,0.58302852962692031,0.24871982443306512,0.13130943672275056]
["C",3,30,28,45,40,0.5,2734,100,1480,776,378,3.6576444769568395E-2,0.54133138258961233,0.28383321141185075,0.13825896122896855]
["C",3,30,28,45,20,0.5,2734,100,1269,948,416,3.6576444769568395E-2,0.46415508412582296,0.34674469641550842,0.15215801024140455]
["C",3,30,18.7,"none",60,0.75,1861,100,1497,227,38,5.3734551316496508E-2,0.80440623320795268,0.12197743148844707,2.0419129500268671E-2]
["C",3,30,18.7,45,60,0.75,1861,100,1177,244,341,5.3734551316496508E-2,0.63245566899516392,0.13111230521225148,0.18323481998925309]
["C",3,30,18.7,45,40,0.75,1861,100,1115,290,355,5.3734551316496508E-2,0.5991402471789361,0.15583019881783988,0.19075765717356261]
["C",3,30,18.7,45,20,0.75,1861,100,990,384,387,5.3734551316496508E-2,0.53197205803331538,0.20634067705534659,0.20795271359484149]
{"$rows_left_out":41}
{"sheet":"C-4ft","index":9,"n_rows":50,"n_cols":16,"rows_kept":50,"cut":false,"hidden":true,"merged":[]}
[null,null,null,null,null,null,null,"Runoff","ET","Drainage","Overflow","Exfiltration"]
["Soil Type","Media Depth","Surf Storage","Area Ratio","Top of IWS","DC","Area Ratio","Rainfall","ET","Drainage","Runoff","VertSeepage","ET","Drainage","Overflow","Exfiltration"]
["C",4,30,28,"none",60,0.5,2734,101,1958,620,55,{"$f":"I3/H3","v":3.6942209217264085E-2},{"$f":"J3/H3","v":0.71616678858814919},{"$f":"K3/H3","v":0.22677395757132407},{"$f":"L3/H3","v":2.0117044623262619E-2}]
["C",4,30,28,45,60,0.5,2734,101,1477,663,493,3.6942209217264085E-2,0.54023408924652527,0.24250182882223847,0.18032187271397221]
["C",4,30,28,45,40,0.5,2734,101,1345,773,515,3.6942209217264085E-2,0.49195318215069495,0.28273591806876369,0.18836869056327724]
["C",4,30,28,45,20,0.5,2734,101,1167,911,555,3.6942209217264085E-2,0.42684711046086321,0.33321141185076808,0.20299926847110461]
["C",4,30,18.7,"none",60,0.75,1861,101,1494,218,49,5.4271896829661471E-2,0.80279419666845786,0.11714132186996239,2.6329930145083287E-2]
["C",4,30,18.7,45,60,0.75,1861,101,1059,236,466,5.4271896829661471E-2,0.56904889844169804,0.12681354110693177,0.25040300913487373]
["C",4,30,18.7,45,40,0.75,1861,101,990,287,483,5.4271896829661471E-2,0.53197205803331538,0.15421816227834498,0.25953788285867813]
["C",4,30,18.7,45,20,0.75,1861,101,883,362,515,5.4271896829661471E-2,0.47447608812466419,0.19451907576571736,0.27673293927995701]
{"$rows_left_out":41}
{"sheet":"D-3ft","index":10,"n_rows":50,"n_cols":16,"rows_kept":50,"cut":false,"hidden":true,"merged":[]}
[null,null,null,null,null,null,null,"Runoff","ET","Drainage","Overflow","Exfiltration"]
["Soil Type","Media Depth","Surf Storage","Area Ratio","Top of IWS","DC","Area Ratio","Rainfall","ET","Drainage","Runoff","VertSeepage","ET","Drainage","Overflow","Exfiltration"]
["D",3,30,28,"none",60,0.5,2734,100,1991,639,5,{"$f":"I3/H3","v":3.6576444769568395E-2},{"$f":"J3/H3","v":0.72823701536210683},{"$f":"K3/H3","v":0.23372348207754207},{"$f":"L3/H3","v":1.8288222384784199E-3}]
["D",3,30,28,45,60,0.5,2734,101,1865,716,51,3.6942209217264085E-2,0.68215069495245062,0.2618873445501097,1.8653986832479885E-2]
["D",3,30,28,45,40,0.5,2734,101,1754,826,53,3.6942209217264085E-2,0.6415508412582297,0.30212143379663497,1.9385515727871252E-2]
["D",3,30,28,45,20,0.5,2734,101,1546,1031,56,3.6942209217264085E-2,0.56547183613752738,0.37710314557425018,2.0482809070958303E-2]
["D",3,30,18.7,"none",60,0.75,1861,100,1531,227,4,5.3734551316496508E-2,0.82267598065556158,0.12197743148844707,2.1493820526598604E-3]
["D",3,30,18.7,45,60,0.75,1861,101,1450,260,50,5.4271896829661471E-2,0.7791509940891993,0.13970983342289092,2.6867275658248254E-2]
["D",3,30,18.7,45,40,0.75,1861,101,1388,321,52,5.4271896829661471E-2,0.74583557227297148,0.17248790972595379,2.7941966684578184E-2]
["D",3,30,18.7,45,20,0.75,1861,101,1270,436,54,5.4271896829661471E-2,0.6824288017195056,0.23428264373992477,2.9016657710908115E-2]
{"$rows_left_out":41}
{"sheet":"D-4ft","index":11,"n_rows":50,"n_cols":16,"rows_kept":50,"cut":false,"hidden":true,"merged":[]}
[null,null,null,null,null,null,null,"Runoff","ET","Drainage","Overflow","Exfiltration"]
["Soil Type","Media Depth","Surf Storage","Area Ratio","Top of IWS","DC","Area Ratio","Rainfall","ET","Drainage","Runoff","VertSeepage","ET","Drainage","Overflow","Exfiltration"]
["D",4,30,28,"none",60,0.5,2734,101,2007,620,6,{"$f":"I3/H3","v":3.6942209217264085E-2},{"$f":"J3/H3","v":0.73408924652523777},{"$f":"K3/H3","v":0.22677395757132407},{"$f":"L3/H3","v":2.1945866861741038E-3}]
["D",4,30,28,45,60,0.5,2734,101,1856,705,72,3.6942209217264085E-2,0.67885881492318945,0.25786393562545723,2.6335040234089245E-2]
["D",4,30,28,45,40,0.5,2734,101,1732,827,74,3.6942209217264085E-2,0.63350402340892464,0.30248719824433062,2.7066569129480616E-2]
["D",4,30,28,45,20,0.5,2734,101,1531,1025,77,3.6942209217264085E-2,0.55998536942209221,0.37490855888807606,2.8163862472567667E-2]
["D",4,30,18.7,"none",60,0.75,1861,101,1537,218,6,5.4271896829661471E-2,0.82590005373455133,0.11714132186996239,3.2240730789897904E-3]
["D",4,30,18.7,45,60,0.75,1861,101,1433,256,71,5.4271896829661471E-2,0.77001612036539491,0.13756045137023107,3.8151531434712518E-2]
["D",4,30,18.7,45,40,0.75,1861,101,1367,321,72,5.4271896829661471E-2,0.73455131649650729,0.17248790972595379,3.8688876947877482E-2]
["D",4,30,18.7,45,20,0.75,1861,101,1253,432,75,5.4271896829661471E-2,0.6732939279957012,0.23213326168726492,4.0300913487372379E-2]
{"$rows_left_out":41}
{"sheet":"D-5ft","index":12,"n_rows":50,"n_cols":16,"rows_kept":50,"cut":false,"hidden":true,"merged":[]}
[null,null,null,null,null,null,null,"Runoff","ET","Drainage","Overflow","Exfiltration"]
["Soil Type","Media Depth","Surf Storage","Area Ratio","Top of IWS","DC","Area Ratio","Rainfall","ET","Drainage","Runoff","VertSeepage","ET","Drainage","Overflow","Exfiltration"]
["D",5,30,28,"none",60,0.5,2734,100,2014,615,5,{"$f":"I3/H3","v":3.6576444769568395E-2},{"$f":"J3/H3","v":0.73664959765910754},{"$f":"K3/H3","v":0.22494513533284566},{"$f":"L3/H3","v":1.8288222384784199E-3}]
["D",5,30,28,45,60,0.5,2734,101,1839,701,93,3.6942209217264085E-2,0.67264081931236286,0.25640087783467447,3.4016093635698609E-2]
["D",5,30,28,45,40,0.5,2734,101,1720,819,94,3.6942209217264085E-2,0.62911485003657641,0.29956108266276515,3.4381858083394293E-2]
["D",5,30,28,45,20,0.5,2734,101,1514,1021,98,3.6942209217264085E-2,0.55376737381126551,0.37344550109729335,3.5844915874177027E-2]
["D",5,30,18.7,"none",60,0.75,1861,100,1542,215,4,5.3734551316496508E-2,0.82858678130037611,0.1155292853304675,2.1493820526598604E-3]
["D",5,30,18.7,45,60,0.75,1861,101,1414,255,92,5.4271896829661471E-2,0.75980655561526056,0.13702310585706609,4.9435787211176786E-2]
["D",5,30,18.7,45,40,0.75,1861,101,1351,316,93,5.4271896829661471E-2,0.72595378828586776,0.16980118216012896,4.997313272434175E-2]
["D",5,30,18.7,45,20,0.75,1861,101,1236,428,96,5.4271896829661471E-2,0.66415905427189681,0.22998387963460504,5.1585169263836647E-2]
{"$rows_left_out":40}