{"text_format":"1","workbook":"xlsx","n_sheets":13,"sheets":["About BRC HyPerTool","BRC HyPerTool","All_Simulations","All_Graphs","A-2ft","A-3ft","B-3ft","B-4ft","C-3ft","C-4ft","D-3ft","D-4ft","D-5ft"],"not_rendered":{"charts":73,"images":4,"macros":1,"external_links":0,"defined_names":27,"comments":1,"pivot_tables":0},"unopened":[],"bounds":{"document_bytes":16777216,"sheet_cells":100000,"rows_first":2000,"rows_last":500,"rows_between":2000,"halvings":0,"cell_chars":16384,"cell_head_chars":4096},"cells_cut":0,"cells_raw":0,"read":"whole","date_system":"1900"}

{"sheet":"About BRC HyPerTool","index":0,"n_rows":65,"n_cols":10,"rows_kept":65,"cut":false,"hidden":false,"merged":[[67,1,67,7],[68,1,68,7],[58,1,60,7],[64,1,66,7],[25,9,25,10],[20,1,26,7],[38,1,41,7],[55,1,57,7],[61,1,63,7],[44,1,46,7],[43,1,43,7],[47,1,49,7],[51,1,51,7],[52,1,54,7],[19,1,19,7],[28,1,28,7],[36,1,36,7],[2,0,2,8],[7,0,7,8],[10,1,17,7],[29,1,34,7],[9,1,9,7],[3,1,3,7],[4,1,4,7],[5,1,5,7],[6,1,6,7]]}
["North Carolina Long-Term Bioretention Hydrologic Performance Tool"]
[]
["LONG-TERM MODELING OF BIORETENTION HYDROLOGY WITH DRAINMOD"]
[null,"Developed by: Drs. Robert A. Brown, William F. Hunt, and R. Wayne Skaggs"]
[null,"Department of Biological and Agricultural Engineering"]
[null,"North Carolina State University, Raleigh, North Carolina"]
[null,"Contact: Dr. William (Bill) F. Hunt, 919-515-6715, bill_hunt@ncsu.edu"]
[" Funded by: Water Resources Research Institute (WRRI) of the University of North Carolina"]
[]
[null,"INTRODUCTION"]
[null,"Previous bioretention design standards in North Carolina relied upon capture and treatment of a specific water quality volume.  This \"one size fits all\" approach, while conservative, does not allow designers and regulators to assess the average annual performance of bioretention cells with varying design features.  DRAINMOD allows for accurate long-term prediction of bioretention hydrology by simulating drainage system designs under complex saturated and unsaturated conditions using real weather data. Output from DRAINMOD simulations of various bioretention designs for the state of North Carolina are provided in this model."]
[]
[]
[]
[]
[]
[]
[]
[]
[null,"MODEL APPLICATIONS"]
[null,"The North Carolina Long-Term Bioretention Hydrologic Performance Tool (HyPerTool) may be used to estimate the hydrologic and water quality functions of bioretention cells with specific hydraulic design features.  Analysis is performed on an arbitrary bioretention system containing the NCDENR (2009) recommended soil media.  Designs can be optimized for project constraints by adjusting the depth of soil media,  internal water storage (IWS), average surface ponding depth, and surface storge volume (relative to the water quality volume). "]
[]
[]
[]
[]
[null,null,null,null,null,null,null,null,null,"Project Partners"]
[]
[]
[null,"MODEL LIMITATIONS"]
[null,"This model may be used as a tool to analyze bioretention performance, however, all models are approximations of reality; users should understand the inherent error associated with the model output (see Brown et al., 2011 for model details).  Only realistic drainage system configurations were modeled (e.g. two-foot-deep cells built in hydrologic soil group D were not modeled because this design will not meet water quantity/quality goals).  "]
[]
[]
[]
[]
[]
[]
[null,"REFERENCES"]
[null,"Model"]
[null,"Brown, R.A., Hunt, W.F., and Skaggs, R.W. 2011. \"Long-term Modeling of Bioretention \n     Hydrology with DRAINMOD.\" Project #70255. Water Resources Research Institute of \n     the University of North Carolina, N.C. State University, Raleigh, N.C., 1-113. \n     (Submitted)."]
[]
[]
[]
[]
[null,"Average Runoff Nutrient Concentrations"]
[null,"Barrett, M. E., P. Kearfott, and J. F. Malina, Jr. 2006. Stormwater quality benefits of a \n     porous friction  course and its effect on pollutant removal by roadside shoulders. \n     Water Environment Research.  78(11):2177-2185."]
[]
[]
[null,"Passeport, E., and W.F. Hunt.  2009a. \"Asphalt Parking Lot Runoff Nutrient \n     Characterization for Eight Sites in North Carolina, USA.\"  Journal of Environmental \n     Engineering. 14(4): 352-361."]
[]
[]
[]
[null,"Average Bioretetion Drainage Effluent Concentrations"]
[null,"Brown, R.A. and W.F. Hunt.Underdrain Configuration to Enhance Bioretention \n     Exfiltration to Reduce Pollutant Loads. Journal of Environmental Engineering. (in \n     press - November 2011)."]
[]
[]
[null,"Hunt, W.F. Smith, J.T., Jadlocki, S.J., Hathaway, J.M., Eubanks, P.R. 2008. Pollutant \n     Removal and Peak Flow Mitigation by a Bioretention Cell in Urban Charlotte, N.C. \n     Journal of Environmental Engineering, 134(5), 403-408. "]
[]
[]
[null,"Line, D. E. and Hunt, W.F. 2009. Performance of a bioretention area and a level \n     spreader-grass filter strip at two highway sites in north carolina. Journal of \n     Irrigation and Drainage Engineering, 135(2): 217-224."]
[]
[]
[null,"Passeport, E., Hunt, W.F., Line, D.E., Smith, R.A., and Brown. R.A. 2009b. Field study of \n     the ability of two grassed bioretention cells to reduce storm-water runoff \n     pollution. Journal of Irrigation and Drainage Engineering, 135(4): 505-510."]
[]
[]
[null,"Sharkey, L.J. (2006). “The Performance of Bioretention Areas in North Carolina: A \n     Study of Water Quality, Water Quantity, and Soil Media.” M.S. thesis. Raleigh, NC: \n     North Carolina State University, Biological and Agricultural Engineering."]

{"sheet":"BRC HyPerTool","index":1,"n_rows":52,"n_cols":13,"rows_kept":52,"cut":false,"hidden":false,"merged":[[2,12,47,14],[4,2,4,3],[5,2,5,3],[6,2,6,3],[7,2,7,3],[8,2,8,3],[13,2,13,3],[15,2,15,3],[48,5,48,11],[51,5,53,11],[31,2,32,2],[21,2,22,2],[37,0,37,11],[38,0,47,11]]}
["North Carolina Long-Term Bioretention Hydrologic Performance Tool"]
["DESIGN INPUT PARAMETERS",null,null,null,null,null,null,null,null,null,null,null,"NOTES"]
["Units"]
["Hydrologic Soil Group"]
["Soil Media Depth",null,{"$f":"IF(B3=\"SI\",IF(OR(AND(OR(B4=\"C\",B4=\"D\"),B5=0.6),AND(OR(B4=\"A\",B4=\"B\",B4=\"C\"),B5=1.5)),\"PLEASE UPDATE!\",\"m\"),IF(OR(AND(OR(B4=\"C\",B4=\"D\"),B5=2),AND(OR(B4=\"A\",B4=\"B\",B4=\"C\"),B5=5)),\"PLEASE UPDATE!\",\"ft\"))","v":"ft"}]
["Depth to IWS",null,{"$f":"IF(B3=\"SI\",IF(OR(AND(OR(B4=\"D\",B4=\"C\"),B6=30),AND(OR(B4=\"A\",B4=\"B\"),B6=45)),\"PLEASE UPDATE!\",\"cm\"),IF(OR(AND(OR(B4=\"D\",B4=\"C\"),B6=1),AND(OR(B4=\"A\",B4=\"B\"),B6=1.5)),\"PLEASE UPDATE!\",\"ft\"))","v":"ft"}]
["Average Surface Ponding",null,{"$f":"IF(B3=\"SI\",\"cm\",\"in\")","v":"in"}]
["Surface Storage Ratio",null,"relative to WQ volume"]
["Drainage Coefficient",null,{"$f":"IF(AND(OR(B9=1.3,B9=0.6,B9=40,B9=20),B6=\"NO IWS\"),\"PLEASE UPDATE\",IF(B3=\"SI\",\"cm/d\",\"ft/d\"))","v":"ft/d"}]
["BRC Area : Drainage Area Ratio",{"$f":"IF(OR(B7=9,B7=23),(B8*0.11111),IF(OR(B7=12,B7=30),(B8*0.083333),\"\"))","v":""}]
["Factor of Safety","NONE"]
[]
["WATER QUALITY CHARACTERIZATION"]
["Runoff Avg TN Conc.",1.63,"mg/L"]
["Drainage Avg TN Conc.",0.9,"mg/L"]
["Runoff Avg TP Conc.",0.19,"mg/L"]
["Drainage Avg TP Conc.",0.14000000000000001,"mg/L"]
[]
["DESIGN OUTPUT PARAMETERS"]
["Maximum Subgrade Ksat",{"$f":"IF(ISNA(IF(B3=\"SI\",HLOOKUP(B4,All_Simulations!B1:E2,2),HLOOKUP(B4,All_Simulations!B1:E3,3))),\"\",(IF(B3=\"SI\",HLOOKUP(B4,All_Simulations!B1:E2,2),HLOOKUP(B4,All_Simulations!B1:E3,3))))","v":""},{"$f":"IF(B3=\"SI\",\"cm/hr\",\"in/hr\")","v":"in/hr"}]
[]
["HYDROLOGY",{"$f":"IF(B3=\"SI\",\"Total (cm/yr)\",\"Total (in/yr)\")","v":"Total (in/yr)"},"Percent \nof Total"]
["Runoff",{"$f":"IF(B3=\"SI\",IF(ISNA(INDEX(RAINFALL,MATCH('BRC HyPerTool'!$B4&'BRC HyPerTool'!$B5&'BRC HyPerTool'!$B7&All_Simulations!$W3&'BRC HyPerTool'!$B6&'BRC HyPerTool'!$B9,SOILTYPE&MEDIADEPTHSI&SURFSTORAGE&AREARATION&TOPIWS&DRAINAGECOEFF,0))),\"\",(INDEX(RAINFALL,MATCH('BRC HyPerTool'!$B4&'BRC HyPerTool'!$B5&'BRC HyPerTool'!$B7&All_Simulations!$W3&'BRC HyPerTool'!$B6&'BRC HyPerTool'!$B9,SOILTYPE&MEDIADEPTHSI&SURFSTORAGE&AREARATION&TOPIWS&DRAINAGECOEFF,0)))),IF(ISNA(INDEX(RAINFALL,MATCH('BRC HyPerTool'!$B4&'BRC HyPerTool'!$B5&'BRC HyPerTool'!$B7&All_Simulations!$W3&'BRC HyPerTool'!$B6&'BRC HyPerTool'!$B9,SOILTYPE&MEDIADEPTH&SURFSTORAGEENG&AREARATION&TOPIWSENG&DCENG,0))),\"\",((INDEX(RAINFALL,MATCH('BRC HyPerTool'!$B4&'BRC HyPerTool'!$B5&'BRC HyPerTool'!$B7&All_Simulations!$W3&'BRC HyPerTool'!$B6&'BRC HyPerTool'!$B9,SOILTYPE&MEDIADEPTH&SURFSTORAGEENG&AREARATION&TOPIWSENG&DCENG,0)))/2.54)))","v":""}]
["ET",{"$f":"IF(B3=\"SI\",IF(ISNA(INDEX(ET,MATCH('BRC HyPerTool'!$B4&'BRC HyPerTool'!$B5&'BRC HyPerTool'!$B7&All_Simulations!$W3&'BRC HyPerTool'!$B6&'BRC HyPerTool'!$B9,SOILTYPE&MEDIADEPTHSI&SURFSTORAGE&AREARATION&TOPIWS&DRAINAGECOEFF,0))),\"\",IF(B11=\"NONE\",(INDEX(ET,MATCH('BRC HyPerTool'!$B4&'BRC HyPerTool'!$B5&'BRC HyPerTool'!$B7&All_Simulations!$W3&'BRC HyPerTool'!$B6&'BRC HyPerTool'!$B9,SOILTYPE&MEDIADEPTHSI&SURFSTORAGE&AREARATION&TOPIWS&DRAINAGECOEFF,0))),(INDEX(ET_10,MATCH('BRC HyPerTool'!$B4&'BRC HyPerTool'!$B5&'BRC HyPerTool'!$B7&All_Simulations!$W3&'BRC HyPerTool'!$B6&'BRC HyPerTool'!$B9,SOILTYPE&MEDIADEPTHSI&SURFSTORAGE&AREARATION&TOPIWS&DRAINAGECOEFF,0))))),IF(ISNA(INDEX(ET,MATCH('BRC HyPerTool'!$B4&'BRC HyPerTool'!$B5&'BRC HyPerTool'!$B7&All_Simulations!$W3&'BRC HyPerTool'!$B6&'BRC HyPerTool'!$B9,SOILTYPE&MEDIADEPTH&SURFSTORAGEENG&AREARATION&TOPIWSENG&DCENG,0))),\"\",IF(B11=\"NONE\",(INDEX(ET,MATCH('BRC HyPerTool'!$B4&'BRC HyPerTool'!$B5&'BRC HyPerTool'!$B7&All_Simulations!$W3&'BRC HyPerTool'!$B6&'BRC HyPerTool'!$B9,SOILTYPE&MEDIADEPTH&SURFSTORAGEENG&AREARATION&TOPIWSENG&DCENG,0)))/2.54,(INDEX(ET_10,MATCH('BRC HyPerTool'!$B4&'BRC HyPerTool'!$B5&'BRC HyPerTool'!$B7&All_Simulations!$W3&'BRC HyPerTool'!$B6&'BRC HyPerTool'!$B9,SOILTYPE&MEDIADEPTH&SURFSTORAGEENG&AREARATION&TOPIWSENG&DCENG,0)))/2.54)))","v":""},{"$f":"IF(B24=\"\",\"\",B24/$B$23)","v":""}]
["Overflow ",{"$f":"IF(B3=\"SI\",IF(ISNA(INDEX(RUNOFF,MATCH('BRC HyPerTool'!$B4&'BRC HyPerTool'!$B5&'BRC HyPerTool'!$B7&All_Simulations!$W3&'BRC HyPerTool'!$B6&'BRC HyPerTool'!$B9,SOILTYPE&MEDIADEPTHSI&SURFSTORAGE&AREARATION&TOPIWS&DRAINAGECOEFF,0))),\"\",IF(B11=\"NONE\",(INDEX(RUNOFF,MATCH('BRC HyPerTool'!$B4&'BRC HyPerTool'!$B5&'BRC HyPerTool'!$B7&All_Simulations!$W3&'BRC HyPerTool'!$B6&'BRC HyPerTool'!$B9,SOILTYPE&MEDIADEPTHSI&SURFSTORAGE&AREARATION&TOPIWS&DRAINAGECOEFF,0))),(INDEX(Runoff10,MATCH('BRC HyPerTool'!$B4&'BRC HyPerTool'!$B5&'BRC HyPerTool'!$B7&All_Simulations!$W3&'BRC HyPerTool'!$B6&'BRC HyPerTool'!$B9,SOILTYPE&MEDIADEPTHSI&SURFSTORAGE&AREARATION&TOPIWS&DRAINAGECOEFF,0))))),IF(ISNA(INDEX(RUNOFF,MATCH('BRC HyPerTool'!$B4&'BRC HyPerTool'!$B5&'BRC HyPerTool'!$B7&All_Simulations!$W3&'BRC HyPerTool'!$B6&'BRC HyPerTool'!$B9,SOILTYPE&MEDIADEPTH&SURFSTORAGEENG&AREARATION&TOPIWSENG&DCENG,0))),\"\",IF(B11=\"NONE\",(INDEX(RUNOFF,MATCH('BRC HyPerTool'!$B4&'BRC HyPerTool'!$B5&'BRC HyPerTool'!$B7&All_Simulations!$W3&'BRC HyPerTool'!$B6&'BRC HyPerTool'!$B9,SOILTYPE&MEDIADEPTH&SURFSTORAGEENG&AREARATION&TOPIWSENG&DCENG,0)))/2.54,(INDEX(Runoff10,MATCH('BRC HyPerTool'!$B4&'BRC HyPerTool'!$B5&'BRC HyPerTool'!$B7&All_Simulations!$W3&'BRC HyPerTool'!$B6&'BRC HyPerTool'!$B9,SOILTYPE&MEDIADEPTH&SURFSTORAGEENG&AREARATION&TOPIWSENG&DCENG,0)))/2.54)))","v":""},{"$f":"IF(B25=\"\",\"\",B25/$B$23)","v":""}]
["Exfiltration",{"$f":"IF(B3=\"SI\",IF(ISNA(INDEX(VertSeepage,MATCH('BRC HyPerTool'!$B4&'BRC HyPerTool'!$B5&'BRC HyPerTool'!$B7&All_Simulations!$W3&'BRC HyPerTool'!$B6&'BRC HyPerTool'!$B9,SOILTYPE&MEDIADEPTHSI&SURFSTORAGE&AREARATION&TOPIWS&DRAINAGECOEFF,0))),\"\",IF(B11=\"NONE\",(INDEX(VertSeepage,MATCH('BRC HyPerTool'!$B4&'BRC HyPerTool'!$B5&'BRC HyPerTool'!$B7&All_Simulations!$W3&'BRC HyPerTool'!$B6&'BRC HyPerTool'!$B9,SOILTYPE&MEDIADEPTHSI&SURFSTORAGE&AREARATION&TOPIWS&DRAINAGECOEFF,0))),(INDEX(VertSeepage10,MATCH('BRC HyPerTool'!$B4&'BRC HyPerTool'!$B5&'BRC HyPerTool'!$B7&All_Simulations!$W3&'BRC HyPerTool'!$B6&'BRC HyPerTool'!$B9,SOILTYPE&MEDIADEPTHSI&SURFSTORAGE&AREARATION&TOPIWS&DRAINAGECOEFF,0))))),IF(ISNA(INDEX(VertSeepage,MATCH('BRC HyPerTool'!$B4&'BRC HyPerTool'!$B5&'BRC HyPerTool'!$B7&All_Simulations!$W3&'BRC HyPerTool'!$B6&'BRC HyPerTool'!$B9,SOILTYPE&MEDIADEPTH&SURFSTORAGEENG&AREARATION&TOPIWSENG&DCENG,0))),\"\",IF(B11=\"NONE\",(INDEX(VertSeepage,MATCH('BRC HyPerTool'!$B4&'BRC HyPerTool'!$B5&'BRC HyPerTool'!$B7&All_Simulations!$W3&'BRC HyPerTool'!$B6&'BRC HyPerTool'!$B9,SOILTYPE&MEDIADEPTH&SURFSTORAGEENG&AREARATION&TOPIWSENG&DCENG,0)))/2.54,(INDEX(VertSeepage10,MATCH('BRC HyPerTool'!$B4&'BRC HyPerTool'!$B5&'BRC HyPerTool'!$B7&All_Simulations!$W3&'BRC HyPerTool'!$B6&'BRC HyPerTool'!$B9,SOILTYPE&MEDIADEPTH&SURFSTORAGEENG&AREARATION&TOPIWSENG&DCENG,0)))/2.54)))","v":""},{"$f":"IF(B26=\"\",\"\",B26/$B$23)","v":""}]
["Drainage",{"$f":"IF(B3=\"SI\",IF(ISNA(INDEX(DRAINAGE,MATCH('BRC HyPerTool'!$B4&'BRC HyPerTool'!$B5&'BRC HyPerTool'!$B7&All_Simulations!$W3&'BRC HyPerTool'!$B6&'BRC HyPerTool'!$B9,SOILTYPE&MEDIADEPTHSI&SURFSTORAGE&AREARATION&TOPIWS&DRAINAGECOEFF,0))),\"\",IF(B11=\"NONE\",(INDEX(DRAINAGE,MATCH('BRC HyPerTool'!$B4&'BRC HyPerTool'!$B5&'BRC HyPerTool'!$B7&All_Simulations!$W3&'BRC HyPerTool'!$B6&'BRC HyPerTool'!$B9,SOILTYPE&MEDIADEPTHSI&SURFSTORAGE&AREARATION&TOPIWS&DRAINAGECOEFF,0))),(INDEX(Drainage10,MATCH('BRC HyPerTool'!$B4&'BRC HyPerTool'!$B5&'BRC HyPerTool'!$B7&All_Simulations!$W3&'BRC HyPerTool'!$B6&'BRC HyPerTool'!$B9,SOILTYPE&MEDIADEPTHSI&SURFSTORAGE&AREARATION&TOPIWS&DRAINAGECOEFF,0))))),IF(ISNA(INDEX(DRAINAGE,MATCH('BRC HyPerTool'!$B4&'BRC HyPerTool'!$B5&'BRC HyPerTool'!$B7&All_Simulations!$W3&'BRC HyPerTool'!$B6&'BRC HyPerTool'!$B9,SOILTYPE&MEDIADEPTH&SURFSTORAGEENG&AREARATION&TOPIWSENG&DCENG,0))),\"\",IF(B11=\"NONE\",(INDEX(DRAINAGE,MATCH('BRC HyPerTool'!$B4&'BRC HyPerTool'!$B5&'BRC HyPerTool'!$B7&All_Simulations!$W3&'BRC HyPerTool'!$B6&'BRC HyPerTool'!$B9,SOILTYPE&MEDIADEPTH&SURFSTORAGEENG&AREARATION&TOPIWSENG&DCENG,0)))/2.54,(INDEX(Drainage10,MATCH('BRC HyPerTool'!$B4&'BRC HyPerTool'!$B5&'BRC HyPerTool'!$B7&All_Simulations!$W3&'BRC HyPerTool'!$B6&'BRC HyPerTool'!$B9,SOILTYPE&MEDIADEPTH&SURFSTORAGEENG&AREARATION&TOPIWSENG&DCENG,0)))/2.54)))","v":""},{"$f":"IF(B27=\"\",\"\",B27/$B$23)","v":""}]
[]
["VOLUME REDUCTION",{"$f":"IF(B23=\"\",\"\",(B23-B25-B27)/B23)","v":""}]
["TREATS 90% OF RUNOFF?",{"$f":"IF(B23=\"\",\"\",IF(C25>10%,\"NO\",\"YES\"))","v":""}]
[]
["WATER QUALITY",{"$f":"IF(B3=\"SI\",\"Total (kg/ha-yr)\",\"Total (lb/ac-yr)\")","v":"Total (lb/ac-yr)"},"Percent Reduction"]
["Influent Avg Total N",{"$f":"IF(B3=\"SI\",IF(B23=\"\",\"\",(B23*(B10))*1.63/10),IF(B23=\"\",\"\",(B23*(B10))*1.63*2.54*0.8922/10))","v":""}]
["Effluent Avg Total N",{"$f":"IF(B3=\"SI\",IF(B23=\"\",\"\",(B25*B10*1.63/10)+(B27*B10*0.9/10)),IF(B23=\"\",\"\",(B25*B10*1.63*2.54*0.8922/10)+(B27*B10*0.9*2.54*0.8922/10)))","v":""},{"$f":"IF(B23=\"\",\"\",(B33-B34)/B33)","v":""}]
["Influent Avg Total P",{"$f":"IF(B3=\"SI\",IF(B23=\"\",\"\",B23*(B10)*0.19/10),IF(B23=\"\",\"\",B23*(B10)*0.19*2.54*0.8922/10))","v":""}]
["Effluent Avg Total P",{"$f":"IF(B3=\"SI\",IF(B23=\"\",\"\",(B25*B10*0.19/10)+(B27*B10*0.14/10)),IF(B23=\"\",\"\",(B25*B10*0.19*2.54*0.8922/10)+(B27*B10*0.14*2.54*0.8922/10)))","v":""},{"$f":"IF(B23=\"\",\"\",(B35-B36)/B35)","v":""}]
[]
[]
[]
[]
[]
[]
[]
[]
[]
[]
[]
[]
[null,null,null,null,"Created by: ","Drs. Robert A. Brown, William F. Hunt, and R. Wayne Skaggs, NCSU, 2011"]
[null,null,null,null,"Contact: ","Dr. William (Bill) F. Hunt, 919-515-6715, bill_hunt@ncsu.edu"]
[null,null,null,null,"Funding by:  ","Water Resources Research Institute (WRRI) of the University of North Carolina"]
[null,null,null,null,"References:","Model:  Brown et al., 2011.  Influent Concentrations: Passeport and Hunt, 2009a.  Effluent Concentrations:  Barrett et al., 2006; Brown and Hunt, 2011; Hunt et al., 2008; Li et al., 2009; Line and Hunt, 2009; Passeport et al., 2009b; Sharkey, 2006."]

{"sheet":"All_Simulations","index":2,"n_rows":443,"n_cols":24,"rows_kept":443,"cut":false,"hidden":true,"merged":[[0,8,0,13],[0,6,0,7],[0,16,0,21]]}
["Soil Type","A","B","C","D",null,"1-ac 100% imp. Drainage area",null,"Drain Area Ratio",null,null,null,null,null,null,null,"Variable Selection Lists"]
["Ksat (cm/hr)",3,0.35,0.05,5.0000000000000001E-3,null,"Surf. Stor","Relative to 100%",0.5,0.75,1,1.25,1.5,2,null,null,"Factors of Safety","Units","Media Depth","Ponding","Depth to IWS","DC"]
["Ksat (in/hr)",{"$f":"ROUND(B2/2.54,2)","v":1.18},{"$f":"ROUND(C2/2.54,2)","v":0.14000000000000001},{"$f":"(ROUND(D2/2.54,3))","v":0.02},{"$f":"ROUND(E2/2.54,4)","v":2E-3},12,"30 cm",14,{"$f":"$H$3/I2","v":28},{"$f":"ROUND($H$3/J2,1)","v":18.7},{"$f":"$H$3/K2","v":14},{"$f":"$H$3/L2","v":11.2},{"$f":"ROUND($H$3/M2,1)","v":9.3000000000000007},{"$f":"$H$3/N2","v":7},14,null,"Safety","Units","Media","Ponding","IWS","DC",{"$f":"IF('BRC HyPerTool'!B3=\"SI\",IF(ISNA(IF('BRC HyPerTool'!B7=23,LOOKUP('BRC HyPerTool'!B8,Area_Ratio,All_Simulations!I4:N4),LOOKUP('BRC HyPerTool'!B8,Area_Ratio,All_Simulations!I3:N3))),\"\",(IF('BRC HyPerTool'!B7=23,LOOKUP('BRC HyPerTool'!B8,Area_Ratio,All_Simulations!I4:N4),LOOKUP('BRC HyPerTool'!B8,Area_Ratio,All_Simulations!I3:N3)))),IF(ISNA(IF('BRC HyPerTool'!B7=9,LOOKUP('BRC HyPerTool'!B8,Area_Ratio,All_Simulations!I4:N4),LOOKUP('BRC HyPerTool'!B8,Area_Ratio,All_Simulations!I3:N3))),\"\",(IF('BRC HyPerTool'!B7=9,LOOKUP('BRC HyPerTool'!B8,Area_Ratio,All_Simulations!I4:N4),LOOKUP('BRC HyPerTool'!B8,Area_Ratio,All_Simulations!I3:N3)))))","v":""}]
[null,null,null,null,null,9,"23 cm",10.199999999999999,{"$f":"$H$4/I2","v":20.399999999999999},13.6,10.199999999999999,{"$f":"ROUND($H$4/L2,1)","v":8.1999999999999993},6.8,5.0999999999999996,10.199999999999999,null,"NONE","SI",{"$f":"IF('BRC HyPerTool'!B3=\"SI\",(IF('BRC HyPerTool'!B4=\"A\",0.6,0.9)),(IF('BRC HyPerTool'!B4=\"A\",2,3)))","v":3},{"$f":"IF('BRC HyPerTool'!B3=\"SI\",23,9)","v":9},"NO IWS",{"$f":"IF('BRC HyPerTool'!B3=\"SI\",60,2)","v":2}]
[null,null,null,null,null,null,null,null,null,null,null,null,null,null,null,null,0.1,"English",{"$f":"IF('BRC HyPerTool'!B3=\"SI\",IF(S4=0.6,0.9,1.2),IF(S4=2,3,4))","v":4},{"$f":"IF('BRC HyPerTool'!B3=\"SI\",30,12)","v":12},{"$f":"IF('BRC HyPerTool'!B3=\"SI\",IF(OR('BRC HyPerTool'!B4=\"A\",'BRC HyPerTool'!B4=\"B\"),30,45),IF(OR('BRC HyPerTool'!B4=\"A\",'BRC HyPerTool'!B4=\"B\"),1,1.5))","v":1.5},{"$f":"IF('BRC HyPerTool'!B3=\"SI\",IF('BRC HyPerTool'!B6=\"NO IWS\",\"\",40),IF('BRC HyPerTool'!B6=\"NO IWS\",\"\",1.3))","v":1.3}]
[null,null,null,null,null,null,null,null,null,null,null,null,null,null,null,null,null,null,{"$f":"IF('BRC HyPerTool'!B3=\"SI\",IF('BRC HyPerTool'!B4=\"D\",1.5,\"\"),IF('BRC HyPerTool'!B4=\"D\",5,\"\"))","v":""},null,null,{"$f":"IF('BRC HyPerTool'!B3=\"SI\",IF('BRC HyPerTool'!B6=\"NO IWS\",\"\",20),IF('BRC HyPerTool'!B6=\"NO IWS\",\"\",0.6))","v":0.6}]
[]
[]
[null,null,null,null,null,null,"A & B - 1 ft","A & B - 30 cm",null,"Conv - 60"]
["A,B,C, or D","2, 3, 4, or 5 ft","m","9 or 12 in","23 or 30 cm",null,"C & D - 1.5 ft","C & D 45 cm",null,"IWS - 60,40,20","Runoff","ET",null,"Drainage",null,"Overflow",null,"Exfiltration"]
["Soil Type","Media Depth","Media Depth","Surf Storage","Surf Storage","Area Ratio","Top of IWS","Top of IWS","DC","DC (cm/day)","Rainfall","ET","ET (10%)","Drainage","Drainage (10%)","Runoff","Overflow (10%)","VertSeepage","Exfilt (10%)","Area Ratio","ET","Drainage","Overflow","Exfiltration"]
["A",2,0.6,12,30,28,"NO IWS","NO IWS",2,60,2734,100,{"$f":"L12*0.9","v":90},1055,{"$f":"K12-(M12+Q12+S12)","v":1093.5999999999999},651,{"$f":"P12*1.1","v":716.1},927,{"$f":"0.9*R12","v":834.30000000000007},0.5,{"$f":"L12/K12","v":3.6576444769568395E-2},{"$f":"N12/K12","v":0.38588149231894658},{"$f":"P12/K12","v":0.23811265544989027},{"$f":"R12/K12","v":0.33906364301389907}]
["A",2,0.6,12,30,28,1,30,2,60,2734,100,{"$f":"L13*0.9","v":90},0,{"$f":"K13-(M13+Q13+S13)","v":142.29999999999973},651,{"$f":"P13*1.1","v":716.1},1984,{"$f":"0.9*R13","v":1785.6000000000001},0.5,3.6576444769568395E-2,0,0.23811265544989027,0.72567666422823707]
["A",2,0.6,12,30,28,1,30,1.3,40,2734,100,90,0,142.29999999999973,651,716.1,1984,1785.6000000000001,0.5,3.6576444769568395E-2,0,0.23811265544989027,0.72567666422823707]
["A",2,0.6,12,30,28,1,30,0.6,20,2734,100,90,0,142.29999999999973,651,716.1,1984,1785.6000000000001,0.5,3.6576444769568395E-2,0,0.23811265544989027,0.72567666422823707]
["A",2,0.6,12,30,18.7,"NO IWS","NO IWS",2,60,1861,100,90,781,842.39999999999986,233,256.3,747,672.30000000000007,0.75,5.3734551316496508E-2,0.41966684578183772,0.12520150456743687,0.40139709833422893]
["A",2,0.6,12,30,18.7,1,30,2,60,1861,100,90,0,138.59999999999991,233,256.3,1529,1376.1000000000001,0.75,5.3734551316496508E-2,0,0.12520150456743687,0.82160128962923162]
["A",2,0.6,12,30,18.7,1,30,1.3,40,1861,100,90,0,138.59999999999991,233,256.3,1529,1376.1000000000001,0.75,5.3734551316496508E-2,0,0.12520150456743687,0.82160128962923162]
["A",2,0.6,12,30,18.7,1,30,0.6,20,1861,100,90,0,138.59999999999991,233,256.3,1529,1376.1000000000001,0.75,5.3734551316496508E-2,0,0.12520150456743687,0.82160128962923162]
["A",2,0.6,12,30,14,"NO IWS","NO IWS",2,60,1420,100,90,597,659.5,99,108.9,624,561.6,1,7.0422535211267609E-2,0.4204225352112676,6.9718309859154934E-2,0.43943661971830988]
["A",2,0.6,12,30,14,1,30,2,60,1420,100,90,0,121.29999999999995,99,108.9,1222,1099.8,1,7.0422535211267609E-2,0,6.9718309859154934E-2,0.8605633802816901]
["A",2,0.6,12,30,14,1,30,1.3,40,1420,100,90,0,121.29999999999995,99,108.9,1222,1099.8,1,7.0422535211267609E-2,0,6.9718309859154934E-2,0.8605633802816901]
["A",2,0.6,12,30,14,1,30,0.6,20,1420,100,90,0,121.29999999999995,99,108.9,1222,1099.8,1,7.0422535211267609E-2,0,6.9718309859154934E-2,0.8605633802816901]
["A",2,0.6,12,30,11.2,"NO IWS","NO IWS",2,60,1158,100,90,471,529.9,49,53.900000000000006,538,484.2,1.25,8.6355785837651119E-2,0.40673575129533679,4.231433506044905E-2,0.46459412780656306]
["A",2,0.6,12,30,11.2,1,30,2,60,1158,100,90,0,106,49,53.900000000000006,1009,908.1,1.25,8.6355785837651119E-2,0,4.231433506044905E-2,0.87132987910189985]
["A",2,0.6,12,30,11.2,1,30,1.3,40,1158,100,90,0,106,49,53.900000000000006,1009,908.1,1.25,8.6355785837651119E-2,0,4.231433506044905E-2,0.87132987910189985]
["A",2,0.6,12,30,11.2,1,30,0.6,20,1158,100,90,0,106,49,53.900000000000006,1009,908.1,1.25,8.6355785837651119E-2,0,4.231433506044905E-2,0.87132987910189985]
["A",2,0.6,12,30,9.3000000000000007,"NO IWS","NO IWS",2,60,979,99,89.100000000000009,381,435.6,26,28.6,473,425.7,1.5,0.10112359550561797,0.3891726251276813,2.6557711950970377E-2,0.48314606741573035]
["A",2,0.6,12,30,9.3000000000000007,1,30,2,60,979,99,89.100000000000009,0,92.699999999999932,26,28.6,854,768.6,1.5,0.10112359550561797,0,2.6557711950970377E-2,0.87231869254341166]
["A",2,0.6,12,30,9.3000000000000007,1,30,1.3,40,979,99,89.100000000000009,0,92.699999999999932,26,28.6,854,768.6,1.5,0.10112359550561797,0,2.6557711950970377E-2,0.87231869254341166]
["A",2,0.6,12,30,9.3000000000000007,1,30,0.6,20,979,99,89.100000000000009,0,92.699999999999932,26,28.6,854,768.6,1.5,0.10112359550561797,0,2.6557711950970377E-2,0.87231869254341166]
["A",2,0.6,12,30,7,"NO IWS","NO IWS",2,60,764,99,89.100000000000009,269,316.49999999999994,10,11,386,347.40000000000003,2,0.12958115183246074,0.35209424083769636,1.3089005235602094E-2,0.50523560209424079]
["A",2,0.6,12,30,7,1,30,2,60,764,99,89.100000000000009,0,74.399999999999977,10,11,655,589.5,2,0.12958115183246074,0,1.3089005235602094E-2,0.85732984293193715]
["A",2,0.6,12,30,7,1,30,1.3,40,764,99,89.100000000000009,0,74.399999999999977,10,11,655,589.5,2,0.12958115183246074,0,1.3089005235602094E-2,0.85732984293193715]
["A",2,0.6,12,30,7,1,30,0.6,20,764,99,89.100000000000009,0,74.399999999999977,10,11,655,589.5,2,0.12958115183246074,0,1.3089005235602094E-2,0.85732984293193715]
["A",2,0.6,9,23,20.399999999999999,"NO IWS","NO IWS",2,60,2021,100,90,788,836.59999999999991,378,415.8,754,678.6,0.5,4.9480455220188027E-2,0.38990598713508162,0.18703612073231074,0.37308263236021771]
["A",2,0.6,9,23,20.399999999999999,1,30,2,60,2021,100,90,0,125.59999999999991,378,415.8,1544,1389.6000000000001,0.5,4.9480455220188027E-2,0,0.18703612073231074,0.7639782285997031]
["A",2,0.6,9,23,20.399999999999999,1,30,1.3,40,2021,100,90,0,125.59999999999991,378,415.8,1544,1389.6000000000001,0.5,4.9480455220188027E-2,0,0.18703612073231074,0.7639782285997031]
["A",2,0.6,9,23,20.399999999999999,1,30,0.6,20,2021,100,90,0,125.59999999999991,378,415.8,1544,1389.6000000000001,0.5,4.9480455220188027E-2,0,0.18703612073231074,0.7639782285997031]
["A",2,0.6,9,23,13.6,"NO IWS","NO IWS",2,60,1383,100,90,558,615.29999999999995,126,138.60000000000002,599,539.1,0.75,7.230657989877079E-2,0.40347071583514099,9.1106290672451198E-2,0.43311641359363701]
["A",2,0.6,9,23,13.6,1,30,2,60,1383,100,90,0,113.09999999999991,126,138.60000000000002,1157,1041.3,0.75,7.230657989877079E-2,0,9.1106290672451198E-2,0.836587129428778]
["A",2,0.6,9,23,13.6,1,30,1.3,40,1383,100,90,0,113.09999999999991,126,138.60000000000002,1157,1041.3,0.75,7.230657989877079E-2,0,9.1106290672451198E-2,0.836587129428778]
["A",2,0.6,9,23,13.6,1,30,0.6,20,1383,100,90,0,113.09999999999991,126,138.60000000000002,1157,1041.3,0.75,7.230657989877079E-2,0,9.1106290672451198E-2,0.836587129428778]
["A",2,0.6,9,23,10.199999999999999,"NO IWS","NO IWS",2,60,1064,100,90,414,468.4,53,58.300000000000004,497,447.3,1,9.3984962406015032E-2,0.38909774436090228,4.9812030075187967E-2,0.46710526315789475]
["A",2,0.6,9,23,10.199999999999999,1,30,2,60,1064,100,90,0,95.799999999999955,53,58.300000000000004,911,819.9,1,9.3984962406015032E-2,0,4.9812030075187967E-2,0.85620300751879697]
["A",2,0.6,9,23,10.199999999999999,1,30,1.3,40,1064,100,90,0,95.799999999999955,53,58.300000000000004,911,819.9,1,9.3984962406015032E-2,0,4.9812030075187967E-2,0.85620300751879697]
["A",2,0.6,9,23,10.199999999999999,1,30,0.6,20,1064,100,90,0,95.799999999999955,53,58.300000000000004,911,819.9,1,9.3984962406015032E-2,0,4.9812030075187967E-2,0.85620300751879697]
["A",2,0.6,9,23,8.1999999999999993,"NO IWS","NO IWS",2,60,876,99,89.100000000000009,322,372.19999999999993,26,28.6,429,386.1,1.25,0.11301369863013698,0.36757990867579909,2.9680365296803651E-2,0.48972602739726029]
["A",2,0.6,9,23,8.1999999999999993,1,30,2,60,876,99,89.100000000000009,0,82.399999999999977,26,28.6,751,675.9,1.25,0.11301369863013698,0,2.9680365296803651E-2,0.85730593607305938]
["A",2,0.6,9,23,8.1999999999999993,1,30,1.3,40,876,99,89.100000000000009,0,82.399999999999977,26,28.6,751,675.9,1.25,0.11301369863013698,0,2.9680365296803651E-2,0.85730593607305938]
["A",2,0.6,9,23,8.1999999999999993,1,30,0.6,20,876,99,89.100000000000009,0,82.399999999999977,26,28.6,751,675.9,1.25,0.11301369863013698,0,2.9680365296803651E-2,0.85730593607305938]
["A",2,0.6,9,23,6.8,"NO IWS","NO IWS",2,60,745,99,89.100000000000009,256,302.09999999999997,14,15.400000000000002,376,338.40000000000003,1.5,0.13288590604026845,0.34362416107382548,1.8791946308724831E-2,0.50469798657718123]
["A",2,0.6,9,23,6.8,1,30,2,60,745,99,89.100000000000009,0,71.699999999999932,14,15.400000000000002,632,568.80000000000007,1.5,0.13288590604026845,0,1.8791946308724831E-2,0.84832214765100666]
["A",2,0.6,9,23,6.8,1,30,1.3,40,745,99,89.100000000000009,0,71.699999999999932,14,15.400000000000002,632,568.80000000000007,1.5,0.13288590604026845,0,1.8791946308724831E-2,0.84832214765100666]
["A",2,0.6,9,23,6.8,1,30,0.6,20,745,99,89.100000000000009,0,71.699999999999932,14,15.400000000000002,632,568.80000000000007,1.5,0.13288590604026845,0,1.8791946308724831E-2,0.84832214765100666]
["A",2,0.6,9,23,5.0999999999999996,"NO IWS","NO IWS",2,60,585,99,89.100000000000009,176,215.89999999999998,5,5.5,305,274.5,2,0.16923076923076924,0.30085470085470084,8.5470085470085479E-3,0.5213675213675214]
["A",2,0.6,9,23,5.0999999999999996,1,30,2,60,585,99,89.100000000000009,0,57.5,5,5.5,481,432.90000000000003,2,0.16923076923076924,0,8.5470085470085479E-3,0.82222222222222219]
["A",2,0.6,9,23,5.0999999999999996,1,30,1.3,40,585,99,89.100000000000009,0,57.5,5,5.5,481,432.90000000000003,2,0.16923076923076924,0,8.5470085470085479E-3,0.82222222222222219]
["A",2,0.6,9,23,5.0999999999999996,1,30,0.6,20,585,99,89.100000000000009,0,57.5,5,5.5,481,432.90000000000003,2,0.16923076923076924,0,8.5470085470085479E-3,0.82222222222222219]
["A",3,0.9,12,30,28,"NO IWS","NO IWS",2,60,2734,100,90,1095,1132.5999999999999,636,699.6,902,811.80000000000007,0.5,3.6576444769568395E-2,0.40051207022677393,0.23262618873445501,0.32991953182150696]
["A",3,0.9,12,30,28,1,30,2,60,2734,100,90,0,144.09999999999991,633,696.30000000000007,2004,1803.6000000000001,0.5,3.6576444769568395E-2,0,0.23152889539136795,0.73299195318215071]
["A",3,0.9,12,30,28,1,30,1.3,40,2734,100,90,0,144.09999999999991,633,696.30000000000007,2004,1803.6000000000001,0.5,3.6576444769568395E-2,0,0.23152889539136795,0.73299195318215071]
["A",3,0.9,12,30,28,1,30,0.6,20,2734,100,90,0,144.09999999999991,633,696.30000000000007,2004,1803.6000000000001,0.5,3.6576444769568395E-2,0,0.23152889539136795,0.73299195318215071]
["A",3,0.9,12,30,18.7,"NO IWS","NO IWS",2,60,1861,100,90,813,872.59999999999991,226,248.60000000000002,722,649.80000000000007,0.75,5.3734551316496508E-2,0.4368619022031166,0.12144008597528211,0.38796346050510477]
["A",3,0.9,12,30,18.7,1,30,2,60,1861,100,90,0,139.49999999999977,224,246.40000000000003,1539,1385.1000000000001,0.75,5.3734551316496508E-2,0,0.12036539494895218,0.82697474476088129]
["A",3,0.9,12,30,18.7,1,30,1.3,40,1861,100,90,0,139.49999999999977,224,246.40000000000003,1539,1385.1000000000001,0.75,5.3734551316496508E-2,0,0.12036539494895218,0.82697474476088129]
["A",3,0.9,12,30,18.7,1,30,0.6,20,1861,100,90,0,139.49999999999977,224,246.40000000000003,1539,1385.1000000000001,0.75,5.3734551316496508E-2,0,0.12036539494895218,0.82697474476088129]
["A",3,0.9,12,30,14,"NO IWS","NO IWS",2,60,1420,100,90,623,683.5,96,105.60000000000001,601,540.9,1,7.0422535211267609E-2,0.43873239436619721,6.7605633802816895E-2,0.4232394366197183]
["A",3,0.9,12,30,14,1,30,2,60,1420,100,90,0,121.20000000000005,95,104.50000000000001,1227,1104.3,1,7.0422535211267609E-2,0,6.6901408450704219E-2,0.86408450704225348]
["A",3,0.9,12,30,14,1,30,1.3,40,1420,100,90,0,121.20000000000005,95,104.50000000000001,1227,1104.3,1,7.0422535211267609E-2,0,6.6901408450704219E-2,0.86408450704225348]
["A",3,0.9,12,30,14,1,30,0.6,20,1420,100,90,0,121.20000000000005,95,104.50000000000001,1227,1104.3,1,7.0422535211267609E-2,0,6.6901408450704219E-2,0.86408450704225348]
["A",3,0.9,12,30,11.2,"NO IWS","NO IWS",2,60,1158,100,90,495,551.9,47,51.7,516,464.40000000000003,1.25,8.6355785837651119E-2,0.42746113989637308,4.0587219343696031E-2,0.44559585492227977]
["A",3,0.9,12,30,11.2,1,30,2,60,1158,100,90,0,106.59999999999991,46,50.6,1012,910.80000000000007,1.25,8.6355785837651119E-2,0,3.9723661485319514E-2,0.87392055267702939]
["A",3,0.9,12,30,11.2,1,30,1.3,40,1158,100,90,0,106.59999999999991,46,50.6,1012,910.80000000000007,1.25,8.6355785837651119E-2,0,3.9723661485319514E-2,0.87392055267702939]
["A",3,0.9,12,30,11.2,1,30,0.6,20,1158,100,90,0,106.59999999999991,46,50.6,1012,910.80000000000007,1.25,8.6355785837651119E-2,0,3.9723661485319514E-2,0.87392055267702939]
["A",3,0.9,12,30,9.3000000000000007,"NO IWS","NO IWS",2,60,979,100,90,402,453.79999999999995,25,27.500000000000004,453,407.7,1.5,{"$f":"L76/K76","v":0.10214504596527069},{"$f":"N76/K76","v":0.41062308478038817},{"$f":"P76/K76","v":2.5536261491317672E-2},{"$f":"R76/K76","v":0.46271705822267623}]
["A",3,0.9,12,30,9.3000000000000007,1,30,2,60,979,99,{"$f":"L77*0.9","v":89.100000000000009},0,{"$f":"K77-(M77+Q77+S77)","v":93.100000000000023},24,{"$f":"P77*1.1","v":26.400000000000002},856,{"$f":"0.9*R77","v":770.4},1.5,0.10112359550561797,0,2.4514811031664963E-2,0.87436159346271702]
["A",3,0.9,12,30,9.3000000000000007,1,30,1.3,40,979,99,89.100000000000009,0,93.100000000000023,24,26.400000000000002,856,770.4,1.5,0.10112359550561797,0,2.4514811031664963E-2,0.87436159346271702]
["A",3,0.9,12,30,9.3000000000000007,1,30,0.6,20,979,99,89.100000000000009,0,93.100000000000023,24,26.400000000000002,856,770.4,1.5,0.10112359550561797,0,2.4514811031664963E-2,0.87436159346271702]
["A",3,0.9,12,30,7,"NO IWS","NO IWS",2,60,764,100,90,286,332,9,9.9,369,332.1,2,0.13089005235602094,0.37434554973821987,1.1780104712041885E-2,0.48298429319371727]
["A",3,0.9,12,30,7,1,30,2,60,764,99,89.100000000000009,0,75.5,9,9.9,655,589.5,2,0.12958115183246074,0,1.1780104712041885E-2,0.85732984293193715]
["A",3,0.9,12,30,7,1,30,1.3,40,764,99,89.100000000000009,0,75.5,9,9.9,655,589.5,2,0.12958115183246074,0,1.1780104712041885E-2,0.85732984293193715]
["A",3,0.9,12,30,7,1,30,0.6,20,764,99,89.100000000000009,0,75.5,9,9.9,655,589.5,2,0.12958115183246074,0,1.1780104712041885E-2,0.85732984293193715]
["A",3,0.9,9,23,20.399999999999999,"NO IWS","NO IWS",2,60,2021,100,90,823,870.3,367,403.70000000000005,730,657,0.5,4.9480455220188027E-2,0.40722414646214744,0.18159327065809006,0.36120732310737258]
["A",3,0.9,9,23,20.399999999999999,1,30,2,60,2021,100,90,0,126.39999999999986,365,401.50000000000006,1559,1403.1000000000001,0.5,4.9480455220188027E-2,0,0.18060366155368629,0.77140029688273137]
["A",3,0.9,9,23,20.399999999999999,1,30,1.3,40,2021,100,90,0,126.39999999999986,365,401.50000000000006,1559,1403.1000000000001,0.5,4.9480455220188027E-2,0,0.18060366155368629,0.77140029688273137]
["A",3,0.9,9,23,20.399999999999999,1,30,0.6,20,2021,100,90,0,126.39999999999986,365,401.50000000000006,1559,1403.1000000000001,0.5,4.9480455220188027E-2,0,0.18060366155368629,0.77140029688273137]
["A",3,0.9,9,23,13.6,"NO IWS","NO IWS",2,60,1383,100,90,585,640.59999999999991,121,133.10000000000002,577,519.30000000000007,0.75,7.230657989877079E-2,0.42299349240780909,8.7490961677512649E-2,0.41720896601590746]
["A",3,0.9,9,23,13.6,1,30,2,60,1383,100,90,0,113.39999999999986,120,132,1164,1047.6000000000001,0.75,7.230657989877079E-2,0,8.6767895878524945E-2,0.84164859002169201]
["A",3,0.9,9,23,13.6,1,30,1.3,40,1383,100,90,0,113.39999999999986,120,132,1164,1047.6000000000001,0.75,7.230657989877079E-2,0,8.6767895878524945E-2,0.84164859002169201]
["A",3,0.9,9,23,13.6,1,30,0.6,20,1383,100,90,0,113.39999999999986,120,132,1164,1047.6000000000001,0.75,7.230657989877079E-2,0,8.6767895878524945E-2,0.84164859002169201]
["A",3,0.9,9,23,10.199999999999999,"NO IWS","NO IWS",2,60,1064,100,90,436,488.6,51,56.1,477,429.3,1,9.3984962406015032E-2,0.40977443609022557,4.7932330827067667E-2,0.44830827067669171]
["A",3,0.9,9,23,10.199999999999999,1,30,2,60,1064,100,90,0,95.5,50,55.000000000000007,915,823.5,1,9.3984962406015032E-2,0,4.6992481203007516E-2,0.85996240601503759]
["A",3,0.9,9,23,10.199999999999999,1,30,1.3,40,1064,100,90,0,95.5,50,55.000000000000007,915,823.5,1,9.3984962406015032E-2,0,4.6992481203007516E-2,0.85996240601503759]
["A",3,0.9,9,23,10.199999999999999,1,30,0.6,20,1064,100,90,0,95.5,50,55.000000000000007,915,823.5,1,9.3984962406015032E-2,0,4.6992481203007516E-2,0.85996240601503759]
["A",3,0.9,9,23,8.1999999999999993,"NO IWS","NO IWS",2,60,876,100,90,342,389.5,25,27.500000000000004,410,369,1.25,0.11415525114155251,0.3904109589041096,2.8538812785388126E-2,0.4680365296803653]
["A",3,0.9,9,23,8.1999999999999993,1,30,2,60,876,99,89.100000000000009,0,82.799999999999955,24,26.400000000000002,753,677.7,1.25,0.11301369863013698,0,2.7397260273972601E-2,0.8595890410958904]
["A",3,0.9,9,23,8.1999999999999993,1,30,1.3,40,876,99,89.100000000000009,0,82.799999999999955,24,26.400000000000002,753,677.7,1.25,0.11301369863013698,0,2.7397260273972601E-2,0.8595890410958904]
["A",3,0.9,9,23,8.1999999999999993,1,30,0.6,20,876,99,89.100000000000009,0,82.799999999999955,24,26.400000000000002,753,677.7,1.25,0.11301369863013698,0,2.7397260273972601E-2,0.8595890410958904]
["A",3,0.9,9,23,6.8,"NO IWS","NO IWS",2,60,745,100,90,273,317.59999999999997,13,14.3,359,323.10000000000002,1.5,0.13422818791946309,0.36644295302013424,1.74496644295302E-2,0.48187919463087248]
["A",3,0.9,9,23,6.8,1,30,2,60,745,99,89.100000000000009,0,71.899999999999977,13,14.3,633,569.70000000000005,1.5,0.13288590604026845,0,1.74496644295302E-2,0.84966442953020138]
["A",3,0.9,9,23,6.8,1,30,1.3,40,745,99,89.100000000000009,0,71.899999999999977,13,14.3,633,569.70000000000005,1.5,0.13288590604026845,0,1.74496644295302E-2,0.84966442953020138]
["A",3,0.9,9,23,6.8,1,30,0.6,20,745,99,89.100000000000009,0,71.899999999999977,13,14.3,633,569.70000000000005,1.5,0.13288590604026845,0,1.74496644295302E-2,0.84966442953020138]
["A",3,0.9,9,23,5.0999999999999996,"NO IWS","NO IWS",2,60,585,99,89.100000000000009,190,228.49999999999994,5,5.5,291,261.90000000000003,2,0.16923076923076924,0.3247863247863248,8.5470085470085479E-3,0.49743589743589745]
["A",3,0.9,9,23,5.0999999999999996,1,30,2,60,585,99,89.100000000000009,0,56.600000000000023,5,5.5,482,433.8,2,0.16923076923076924,0,8.5470085470085479E-3,0.82393162393162389]
["A",3,0.9,9,23,5.0999999999999996,1,30,1.3,40,585,99,89.100000000000009,0,56.600000000000023,5,5.5,482,433.8,2,0.16923076923076924,0,8.5470085470085479E-3,0.82393162393162389]
["A",3,0.9,9,23,5.0999999999999996,1,30,0.6,20,585,99,89.100000000000009,0,56.600000000000023,5,5.5,482,433.8,2,0.16923076923076924,0,8.5470085470085479E-3,0.82393162393162389]
["B",3,0.9,12,30,28,"NO IWS","NO IWS",2,60,2734,100,90,1788,1756.1,637,700.7,208,187.20000000000002,0.5,3.6576444769568395E-2,0.65398683247988298,0.23299195318215069,7.6079005120702273E-2]
["B",3,0.9,12,30,28,1,30,2,60,2734,100,90,875,935,634,697.40000000000009,1124,1011.6,0.5,3.6576444769568395E-2,0.3200438917337235,0.23189465983906365,0.41111923920994881]
["B",3,0.9,12,30,28,1,30,1.3,40,2734,100,90,746,806.69999999999982,695,764.50000000000011,1192,1072.8,0.5,3.6576444769568395E-2,0.27286027798098023,0.25420629114850035,0.43599122165325532]
["B",3,0.9,12,30,28,1,30,0.6,20,2734,100,90,565,632.59999999999991,751,826.1,1317,1185.3,0.5,3.6576444769568395E-2,0.20665691294806146,0.27468910021945869,0.48171177761521577]
["B",3,0.9,12,30,18.7,"NO IWS","NO IWS",2,60,1861,100,90,1358,1363.1,226,248.60000000000002,177,159.30000000000001,0.75,5.3734551316496508E-2,0.7297152068780226,0.12144008597528211,9.5110155830198814E-2]
["B",3,0.9,12,30,18.7,1,30,2,60,1861,100,90,578,661.90000000000009,222,244.20000000000002,961,864.9,0.75,5.3734551316496508E-2,0.31058570660934981,0.11929070392262224,0.51638903815153148]
["B",3,0.9,12,30,18.7,1,30,1.3,40,1861,100,90,505,589.5,251,276.10000000000002,1006,905.4,0.75,5.3734551316496508E-2,0.27135948414830735,0.13487372380440624,0.5405695862439549]
["B",3,0.9,12,30,18.7,1,30,0.6,20,1861,100,90,387,477.89999999999986,278,305.8,1097,987.30000000000007,0.75,5.3734551316496508E-2,0.20795271359484149,0.14938205265986029,0.58946802794196673]
["B",3,0.9,12,30,14,"NO IWS","NO IWS",2,60,1420,100,90,1070,1084.9000000000001,96,105.60000000000001,155,139.5,1,7.0422535211267609E-2,0.75352112676056338,6.7605633802816895E-2,0.10915492957746478]
["B",3,0.9,12,30,14,1,30,2,60,1420,100,90,391,475.29999999999995,93,102.30000000000001,836,752.4,1,7.0422535211267609E-2,0.27535211267605636,6.5492957746478869E-2,0.58873239436619718]
["B",3,0.9,12,30,14,1,30,1.3,40,1420,100,90,346,431.29999999999995,106,116.60000000000001,869,782.1,1,7.0422535211267609E-2,0.24366197183098592,7.464788732394366E-2,0.61197183098591545]
["B",3,0.9,12,30,14,1,30,0.6,20,1420,100,90,268,337.39999999999986,139,152.9,933,839.7,1,7.0422535211267609E-2,0.18873239436619718,9.7887323943661966E-2,0.65704225352112677]
["B",3,0.9,12,30,11.2,"NO IWS","NO IWS",2,60,1158,100,90,872,891.2,47,51.7,139,125.10000000000001,1.25,8.6355785837651119E-2,0.75302245250431776,4.0587219343696031E-2,0.12003454231433507]
["B",3,0.9,12,30,11.2,1,30,2,60,1158,100,90,271,350.5,46,50.6,741,666.9,1.25,8.6355785837651119E-2,0.23402417962003455,3.9723661485319514E-2,0.63989637305699487]
["B",3,0.9,12,30,11.2,1,30,1.3,40,1158,100,90,242,322.29999999999995,52,57.2,765,688.5,1.25,8.6355785837651119E-2,0.20898100172711573,4.4905008635578586E-2,0.6606217616580311]
["B",3,0.9,12,30,11.2,1,30,0.6,20,1158,100,90,187,272.10000000000002,60,66,811,729.9,1.25,8.6355785837651119E-2,0.1614853195164076,5.181347150259067E-2,0.70034542314335058]
["B",3,0.9,12,30,9.3000000000000007,"NO IWS","NO IWS",2,60,979,99,89.100000000000009,728,748.1,25,27.500000000000004,127,114.3,1.5,0.10112359550561797,0.74361593462717057,2.5536261491317672E-2,0.12972420837589377]
["B",3,0.9,12,30,9.3000000000000007,1,30,2,60,979,99,89.100000000000009,191,265,24,26.400000000000002,665,598.5,1.5,0.10112359550561797,0.19509703779366699,2.4514811031664963E-2,0.67926455566905009]
["B",3,0.9,12,30,9.3000000000000007,1,30,1.3,40,979,99,89.100000000000009,171,247.29999999999995,27,29.700000000000003,681,612.9,1.5,0.10112359550561797,0.17466802860061287,2.7579162410623085E-2,0.69560776302349336]
["B",3,0.9,12,30,9.3000000000000007,1,30,0.6,20,979,100,90,133,210.29999999999995,32,35.200000000000003,715,643.5,1.5,0.10214504596527069,0.13585291113381001,3.268641470888662E-2,0.7303370786516854]
["B",3,0.9,12,30,7,"NO IWS","NO IWS",2,60,764,99,89.100000000000009,545,566,9,9.9,110,99,2,0.12958115183246074,0.71335078534031415,1.1780104712041885E-2,0.14397905759162305]
["B",3,0.9,12,30,7,1,30,2,60,764,99,89.100000000000009,104,169.09999999999991,9,9.9,551,495.90000000000003,2,0.12958115183246074,0.13612565445026178,1.1780104712041885E-2,0.72120418848167545]
["B",3,0.9,12,30,7,1,30,1.3,40,764,99,89.100000000000009,93,158.79999999999995,11,12.100000000000001,560,504,2,0.12958115183246074,0.12172774869109948,1.4397905759162303E-2,0.73298429319371727]
["B",3,0.9,12,30,7,1,30,0.6,20,764,99,89.100000000000009,73,140.59999999999991,12,13.200000000000001,579,521.1,2,0.12958115183246074,9.5549738219895292E-2,1.5706806282722512E-2,0.75785340314136129]
["B",3,0.9,9,23,20.399999999999999,"NO IWS","NO IWS",2,60,2021,100,90,1374,1365.1,368,404.8,179,161.1,0.5,4.9480455220188027E-2,0.67986145472538351,0.18208807521029194,8.8570014844136569E-2]
["B",3,0.9,9,23,20.399999999999999,1,30,2,60,2021,100,90,571,642.59999999999991,367,403.70000000000005,983,884.7,0.5,4.9480455220188027E-2,0.28253339930727361,0.18159327065809006,0.48639287481444832]
["B",3,0.9,9,23,20.399999999999999,1,30,1.3,40,2021,100,90,496,568.29999999999995,401,441.1,1024,921.6,0.5,4.9480455220188027E-2,0.24542305789213262,0.19841662543295399,0.50667986145472543]
["B",3,0.9,9,23,20.399999999999999,1,30,0.6,20,2021,100,90,372,448.19999999999982,439,482.90000000000003,1111,999.9,0.5,4.9480455220188027E-2,0.18406729341909944,0.21721919841662543,0.54972785749628894]
["B",3,0.9,9,23,13.6,"NO IWS","NO IWS",2,60,1383,100,90,1011,1022.9,122,134.20000000000002,151,135.9,0.75,7.230657989877079E-2,0.73101952277657267,8.8214027476500367E-2,0.10918293564714389]
["B",3,0.9,9,23,13.6,1,30,2,60,1383,100,90,346,425.9,119,130.9,818,736.2,0.75,7.230657989877079E-2,0.25018076644974691,8.6044830079537241E-2,0.59146782357194505]
["B",3,0.9,9,23,13.6,1,30,1.3,40,1383,100,90,305,387.29999999999995,132,145.20000000000002,845,760.5,0.75,7.230657989877079E-2,0.22053506869125089,9.5444685466377438E-2,0.61099060014461315]
["B",3,0.9,9,23,13.6,1,30,0.6,20,1383,100,90,233,318,150,165,900,810,0.75,7.230657989877079E-2,0.16847433116413593,0.10845986984815618,0.65075921908893708]
["B",3,0.9,9,23,10.199999999999999,"NO IWS","NO IWS",2,60,1064,100,90,781,799.1,51,56.1,132,118.8,1,{"$f":"L140/K140","v":9.3984962406015032E-2},{"$f":"N140/K140","v":0.73402255639097747},{"$f":"P140/K140","v":4.7932330827067667E-2},{"$f":"R140/K140","v":0.12406015037593984}]
["B",3,0.9,9,23,10.199999999999999,1,30,2,60,1064,100,{"$f":"L141*0.9","v":90},215,{"$f":"K141-(M141+Q141+S141)","v":289},50,{"$f":"P141*1.1","v":55.000000000000007},700,{"$f":"0.9*R141","v":630},1,9.3984962406015032E-2,0.20206766917293234,4.6992481203007516E-2,0.65789473684210531]
["B",3,0.9,9,23,10.199999999999999,1,30,1.3,40,1064,100,90,191,267.09999999999991,56,61.600000000000009,717,645.30000000000007,1,9.3984962406015032E-2,0.17951127819548873,5.2631578947368418E-2,0.67387218045112784]
["B",3,0.9,9,23,10.199999999999999,1,30,0.6,20,1064,100,90,147,226.09999999999991,63,69.300000000000011,754,678.6,1,9.3984962406015032E-2,0.13815789473684212,5.921052631578947E-2,0.70864661654135341]
["B",3,0.9,9,23,8.1999999999999993,"NO IWS","NO IWS",2,60,876,99,89.100000000000009,634,652.29999999999995,25,27.500000000000004,119,107.10000000000001,1.25,0.11301369863013698,0.72374429223744297,2.8538812785388126E-2,0.13584474885844749]
["B",3,0.9,9,23,8.1999999999999993,1,30,2,60,876,99,89.100000000000009,141,209.69999999999993,24,26.400000000000002,612,550.80000000000007,1.25,0.11301369863013698,0.16095890410958905,2.7397260273972601E-2,0.69863013698630139]
["B",3,0.9,9,23,8.1999999999999993,1,30,1.3,40,876,99,89.100000000000009,127,196.5,27,29.700000000000003,623,560.70000000000005,1.25,0.11301369863013698,0.1449771689497717,3.0821917808219176E-2,0.71118721461187218]
["B",3,0.9,9,23,8.1999999999999993,1,30,0.6,20,876,99,89.100000000000009,97,168.69999999999993,31,34.1,649,584.1,1.25,0.11301369863013698,0.11073059360730593,3.5388127853881277E-2,0.7408675799086758]
["B",3,0.9,9,23,6.8,"NO IWS","NO IWS",2,60,745,99,89.100000000000009,524,544.4,13,14.3,108,97.2,1.5,0.13288590604026845,0.70335570469798658,1.74496644295302E-2,0.14496644295302014]
["B",3,0.9,9,23,6.8,1,30,2,60,745,99,89.100000000000009,93,156.5,13,14.3,539,485.1,1.5,0.13288590604026845,0.12483221476510067,1.74496644295302E-2,0.72348993288590602]
["B",3,0.9,9,23,6.8,1,30,1.3,40,745,99,89.100000000000009,83,146.20000000000005,15,16.5,548,493.2,1.5,0.13288590604026845,0.11140939597315436,2.0134228187919462E-2,0.7355704697986577]
["B",3,0.9,9,23,6.8,1,30,0.6,20,745,99,89.100000000000009,65,129.59999999999991,17,18.700000000000003,564,507.6,1.5,0.13288590604026845,8.7248322147651006E-2,2.2818791946308724E-2,0.75704697986577185]
["B",3,0.9,9,23,5.0999999999999996,"NO IWS","NO IWS",2,60,585,99,89.100000000000009,389,406.7,5,5.5,93,83.7,2,0.16923076923076924,0.66495726495726493,8.5470085470085479E-3,0.15897435897435896]
["B",3,0.9,9,23,5.0999999999999996,1,30,2,60,585,99,89.100000000000009,47,98.899999999999977,5,5.5,435,391.5,2,0.16923076923076924,8.0341880341880348E-2,8.5470085470085479E-3,0.74358974358974361]
["B",3,0.9,9,23,5.0999999999999996,1,30,1.3,40,585,99,89.100000000000009,42,94.199999999999989,6,6.6000000000000005,439,395.1,2,0.16923076923076924,7.179487179487179E-2,1.0256410256410256E-2,0.75042735042735043]
["B",3,0.9,9,23,5.0999999999999996,1,30,0.6,20,585,99,89.100000000000009,32,86.100000000000023,6,6.6000000000000005,448,403.2,2,0.16923076923076924,5.4700854700854701E-2,1.0256410256410256E-2,0.76581196581196587]
["B",4,1.2,12,30,28,"NO IWS","NO IWS",2,60,2734,101,90.9,1778,1748.8999999999999,619,680.90000000000009,237,213.3,0.5,3.6942209217264085E-2,0.65032918800292616,0.22640819312362839,8.6686174103877106E-2]
["B",4,1.2,12,30,28,1,30,2,60,2734,101,90.9,652,735.40000000000009,624,686.40000000000009,1357,1221.3,0.5,3.6942209217264085E-2,0.23847841989758595,0.2282370153621068,0.49634235552304318]
["B",4,1.2,12,30,28,1,30,1.3,40,2734,101,90.9,547,632.5,666,732.6,1420,1278,0.5,3.6942209217264085E-2,0.20007315288953914,0.24359912216532553,0.51938551572787128]
["B",4,1.2,12,30,28,1,30,0.6,20,2734,101,90.9,412,503.90000000000009,697,766.7,1525,1372.5,0.5,3.6942209217264085E-2,0.15069495245062181,0.25493782004389176,0.55779078273591809]
["B",4,1.2,12,30,18.7,"NO IWS","NO IWS",2,60,1861,101,90.9,1341,1349.6,217,238.70000000000002,202,181.8,0.75,5.4271896829661471E-2,0.72058033315421821,0.11660397635679742,0.10854379365932294]
["B",4,1.2,12,30,18.7,1,30,2,60,1861,101,90.9,413,513.89999999999986,215,236.50000000000003,1133,1019.7,0.75,5.4271896829661471E-2,0.22192369693713057,0.1155292853304675,0.60881246641590547]
["B",4,1.2,12,30,18.7,1,30,1.3,40,1861,101,90.9,353,455.90000000000009,235,258.5,1173,1055.7,0.75,5.4271896829661471E-2,0.18968296614723268,0.12627619559376679,0.63030628694250401]
["B",4,1.2,12,30,18.7,1,30,0.6,20,1861,101,90.9,266,374.39999999999986,251,276.10000000000002,1244,1119.6000000000001,0.75,5.4271896829661471E-2,0.1429339065018807,0.13487372380440624,0.66845781837721652]
["B",4,1.2,12,30,14,"NO IWS","NO IWS",2,60,1420,101,90.9,1050,1067.9000000000001,91,100.10000000000001,179,161.1,1,7.1126760563380284E-2,0.73943661971830987,6.4084507042253519E-2,0.12605633802816901]
["B",4,1.2,12,30,14,1,30,2,60,1420,101,90.9,263,359.79999999999995,90,99.000000000000014,967,870.30000000000007,1,7.1126760563380284E-2,0.18521126760563381,6.3380281690140844E-2,0.68098591549295773]
["B",4,1.2,12,30,14,1,30,1.3,40,1420,101,90.9,225,324.70000000000005,99,108.9,995,895.5,1,7.1126760563380284E-2,0.15845070422535212,6.9718309859154934E-2,0.70070422535211263]
["B",4,1.2,12,30,14,1,30,0.6,20,1420,101,90.9,171,273.79999999999995,106,116.60000000000001,1043,938.7,1,7.1126760563380284E-2,0.12042253521126761,7.464788732394366E-2,0.73450704225352115]
["B",4,1.2,12,30,11.2,"NO IWS","NO IWS",2,60,1158,101,90.9,851,872.9,44,48.400000000000006,162,145.80000000000001,1.25,8.7219343696027629E-2,0.73488773747841107,3.7996545768566495E-2,0.13989637305699482]
["B",4,1.2,12,30,11.2,1,30,2,60,1158,100,90,169,259.10000000000002,44,48.400000000000006,845,760.5,1.25,8.6355785837651119E-2,0.1459412780656304,3.7996545768566495E-2,0.72970639032815199]
["B",4,1.2,12,30,11.2,1,30,1.3,40,1158,100,90,148,239.39999999999986,48,52.800000000000004,862,775.80000000000007,1.25,8.6355785837651119E-2,0.12780656303972365,4.145077720207254E-2,0.74438687392055269]
["B",4,1.2,12,30,11.2,1,30,0.6,20,1158,100,90,111,206.20000000000005,52,57.2,894,804.6,1.25,8.6355785837651119E-2,9.585492227979274E-2,4.4905008635578586E-2,0.772020725388601]
["B",4,1.2,12,30,9.3000000000000007,"NO IWS","NO IWS",2,60,979,101,90.9,706,728.7,23,25.3,149,134.1,1.5,0.10316649642492338,0.72114402451481108,2.3493360572012258E-2,0.15219611848825332]
["B",4,1.2,12,30,9.3000000000000007,1,30,2,60,979,100,90,113,193.89999999999998,24,26.400000000000002,743,668.7,1.5,0.10214504596527069,0.11542390194075587,2.4514811031664963E-2,0.75893769152196122]
["B",4,1.2,12,30,9.3000000000000007,1,30,1.3,40,979,100,90,99,182,25,27.500000000000004,755,679.5,1.5,0.10214504596527069,0.10112359550561797,2.5536261491317672E-2,0.77119509703779365]
["B",4,1.2,12,30,9.3000000000000007,1,30,0.6,20,979,100,90,75,159.99999999999989,27,29.700000000000003,777,699.30000000000007,1.5,0.10214504596527069,7.6608784473953015E-2,2.7579162410623085E-2,0.79366700715015326]
["B",4,1.2,12,30,7,"NO IWS","NO IWS",2,60,764,101,90.9,523,545.29999999999995,9,9.9,131,117.9,2,0.13219895287958114,0.68455497382198949,1.1780104712041885E-2,0.17146596858638743]
["B",4,1.2,12,30,7,1,30,2,60,764,100,90,55,125,9,9.9,599,539.1,2,0.13089005235602094,7.1989528795811525E-2,1.1780104712041885E-2,0.78403141361256545]
["B",4,1.2,12,30,7,1,30,1.3,40,764,100,90,48,117.60000000000002,10,11,606,545.4,2,0.13089005235602094,6.2827225130890049E-2,1.3089005235602094E-2,0.79319371727748689]
["B",4,1.2,12,30,7,1,30,0.6,20,764,100,90,36,107.69999999999993,10,11,617,555.30000000000007,2,0.13089005235602094,4.712041884816754E-2,1.3089005235602094E-2,0.80759162303664922]
["B",4,1.2,9,23,20.399999999999999,"NO IWS","NO IWS",2,60,2021,101,90.9,1361,1356.1999999999998,354,389.40000000000003,205,184.5,0.5,4.9975259772389903E-2,0.67342899554675906,0.17516081147946561,0.10143493320138545]
["B",4,1.2,9,23,20.399999999999999,1,30,2,60,2021,101,90.9,401,492.39999999999986,353,388.3,1166,1049.4000000000001,0.5,4.9975259772389903E-2,0.19841662543295399,0.17466600692726372,0.57694210786739242]
["B",4,1.2,9,23,20.399999999999999,1,30,1.3,40,2021,101,90.9,338,430.5,379,416.90000000000003,1203,1082.7,0.5,4.9975259772389903E-2,0.16724393864423553,0.18753092528451262,0.59524987629886195]
["B",4,1.2,9,23,20.399999999999999,1,30,0.6,20,2021,101,90.9,252,348.89999999999986,400,440.00000000000006,1268,1141.2,0.5,4.9975259772389903E-2,0.12469074715487383,0.19792182088075211,0.6274121721919842]
["B",4,1.2,9,23,13.6,"NO IWS","NO IWS",2,60,1383,101,90.9,992,1007,116,127.60000000000001,175,157.5,0.75,7.3029645697758494E-2,0.71728127259580621,8.3875632682574114E-2,0.12653651482284889]
["B",4,1.2,9,23,13.6,1,30,2,60,1383,101,90.9,222,315.09999999999991,115,126.50000000000001,945,850.5,0.75,7.3029645697758494E-2,0.16052060737527116,8.315256688358641E-2,0.68329718004338391]
["B",4,1.2,9,23,13.6,1,30,1.3,40,1383,101,90.9,191,285.39999999999986,124,136.4,967,870.30000000000007,0.75,7.3029645697758494E-2,0.13810556760665221,8.9660159074475776E-2,0.69920462762111357]
["B",4,1.2,9,23,13.6,1,30,0.6,20,1383,101,90.9,142,239.5,133,146.30000000000001,1007,906.30000000000007,0.75,7.3029645697758494E-2,0.10267534345625452,9.6167751265365142E-2,0.72812725958062186]
["B",4,1.2,9,23,10.199999999999999,"NO IWS","NO IWS",2,60,1064,101,90.9,761,780.8,48,52.800000000000004,155,139.5,1,9.492481203007519E-2,0.71522556390977443,4.5112781954887216E-2,0.14567669172932332]
["B",4,1.2,9,23,10.199999999999999,1,30,2,60,1064,100,90,126,210.20000000000005,48,52.800000000000004,790,711,1,9.3984962406015032E-2,0.11842105263157894,4.5112781954887216E-2,0.74248120300751874]
["B",4,1.2,9,23,10.199999999999999,1,30,1.3,40,1064,100,90,110,195.19999999999993,51,56.1,803,722.7,1,9.3984962406015032E-2,0.10338345864661654,4.7932330827067667E-2,0.75469924812030076]
["B",4,1.2,9,23,10.199999999999999,1,30,0.6,20,1064,100,90,83,170.10000000000002,55,60.500000000000007,826,743.4,1,9.3984962406015032E-2,7.8007518796992484E-2,5.1691729323308268E-2,0.77631578947368418]
["B",4,1.2,9,23,8.1999999999999993,"NO IWS","NO IWS",2,60,876,101,90.9,612,632.9,23,25.3,141,126.9,1.25,0.11529680365296803,0.69863013698630139,2.6255707762557076E-2,0.16095890410958905]
["B",4,1.2,9,23,8.1999999999999993,1,30,2,60,876,100,90,76,151.20000000000005,24,26.400000000000002,676,608.4,1.25,0.11415525114155251,8.6757990867579904E-2,2.7397260273972601E-2,0.77168949771689499]
["B",4,1.2,9,23,8.1999999999999993,1,30,1.3,40,876,100,90,67,144,24,26.400000000000002,684,615.6,1.25,0.11415525114155251,7.6484018264840178E-2,2.7397260273972601E-2,0.78082191780821919]
["B",4,1.2,9,23,8.1999999999999993,1,30,0.6,20,876,100,90,51,128.29999999999995,26,28.6,699,629.1,1.25,0.11415525114155251,5.8219178082191778E-2,2.9680365296803651E-2,0.79794520547945202]
["B",4,1.2,9,23,6.8,"NO IWS","NO IWS",2,60,745,101,90.9,503,523.70000000000005,13,14.3,129,116.10000000000001,1.5,0.13557046979865772,0.67516778523489929,1.74496644295302E-2,0.17315436241610738]
["B",4,1.2,9,23,6.8,1,30,2,60,745,100,90,48,115.10000000000002,13,14.3,584,525.6,1.5,0.13422818791946309,6.4429530201342289E-2,1.74496644295302E-2,0.78389261744966443]
["B",4,1.2,9,23,6.8,1,30,1.3,40,745,100,90,41,108.60000000000002,14,15.400000000000002,590,531,1.5,0.13422818791946309,5.5033557046979868E-2,1.8791946308724831E-2,0.79194630872483218]
["B",4,1.2,9,23,6.8,1,30,0.6,20,745,100,90,31,100.5,14,15.400000000000002,599,539.1,1.5,0.13422818791946309,4.1610738255033558E-2,1.8791946308724831E-2,0.80402684563758386]
["B",4,1.2,9,23,5.0999999999999996,"NO IWS","NO IWS",2,60,585,100,90,369,390.7,4,4.4000000000000004,111,99.9,2,0.17094017094017094,0.63076923076923075,6.8376068376068376E-3,0.18974358974358974]
["B",4,1.2,9,23,5.0999999999999996,1,30,2,60,585,100,90,21,76.600000000000023,4,4.4000000000000004,460,414,2,0.17094017094017094,3.5897435897435895E-2,6.8376068376068376E-3,0.78632478632478631]
["B",4,1.2,9,23,5.0999999999999996,1,30,1.3,40,585,100,90,19,73.699999999999989,5,5.5,462,415.8,2,0.17094017094017094,3.2478632478632481E-2,8.5470085470085479E-3,0.78974358974358971]
["B",4,1.2,9,23,5.0999999999999996,1,30,0.6,20,585,100,90,14,70.099999999999909,5,5.5,466,419.40000000000003,2,0.17094017094017094,2.3931623931623933E-2,8.5470085470085479E-3,0.79658119658119653]
["C",3,0.9,12,30,28,"NO IWS","NO IWS",2,60,2734,100,90,1952,1902.6,638,701.80000000000007,44,39.6,0.5,{"$f":"L204/K204","v":3.6576444769568395E-2},{"$f":"N204/K204","v":0.71397220190197508},{"$f":"P204/K204","v":0.23335771762984639},{"$f":"R204/K204","v":1.6093635698610095E-2}]
["C",3,0.9,12,30,28,1.5,45,2,60,2734,100,{"$f":"L205*0.9","v":90},1594,{"$f":"K205-(M205+Q205+S205)","v":1572.8999999999999},680,{"$f":"P205*1.1","v":748.00000000000011},359,{"$f":"0.9*R205","v":323.10000000000002},0.5,3.6576444769568395E-2,0.58302852962692031,0.24871982443306512,0.13130943672275056]
["C",3,0.9,12,30,28,1.5,45,1.3,40,2734,100,90,1480,1450.2,776,853.6,378,340.2,0.5,3.6576444769568395E-2,0.54133138258961233,0.28383321141185075,0.13825896122896855]
["C",3,0.9,12,30,28,1.5,45,0.6,20,2734,100,90,1269,1226.7999999999997,948,1042.8000000000002,416,374.40000000000003,0.5,3.6576444769568395E-2,0.46415508412582296,0.34674469641550842,0.15215801024140455]
["C",3,0.9,12,30,18.7,"NO IWS","NO IWS",2,60,1861,100,90,1497,1487.1,227,249.70000000000002,38,34.200000000000003,0.75,5.3734551316496508E-2,0.80440623320795268,0.12197743148844707,2.0419129500268671E-2]
["C",3,0.9,12,30,18.7,1.5,45,2,60,1861,100,90,1177,1195.6999999999998,244,268.40000000000003,341,306.90000000000003,0.75,5.3734551316496508E-2,0.63245566899516392,0.13111230521225148,0.18323481998925309]
["C",3,0.9,12,30,18.7,1.5,45,1.3,40,1861,100,90,1115,1132.5,290,319,355,319.5,0.75,5.3734551316496508E-2,0.5991402471789361,0.15583019881783988,0.19075765717356261]
["C",3,0.9,12,30,18.7,1.5,45,0.6,20,1861,100,90,990,1000.3,384,422.40000000000003,387,348.3,0.75,5.3734551316496508E-2,0.53197205803331538,0.20634067705534659,0.20795271359484149]
["C",3,0.9,12,30,14,"NO IWS","NO IWS",2,60,1420,100,90,1191,1193.8,96,105.60000000000001,34,30.6,1,7.0422535211267609E-2,0.83873239436619718,6.7605633802816895E-2,2.3943661971830985E-2]
["C",3,0.9,12,30,14,1.5,45,2,60,1420,100,90,890,922.19999999999993,104,114.4,326,293.40000000000003,1,7.0422535211267609E-2,0.62676056338028174,7.3239436619718309E-2,0.22957746478873239]
["C",3,0.9,12,30,14,1.5,45,1.3,40,1420,100,90,856,887,127,139.70000000000002,337,303.3,1,7.0422535211267609E-2,0.60281690140845068,8.9436619718309865E-2,0.23732394366197182]
["C",3,0.9,12,30,14,1.5,45,0.6,20,1420,100,90,778,807.5,178,195.8,363,326.7,1,7.0422535211267609E-2,0.54788732394366202,0.12535211267605634,0.2556338028169014]
["C",3,0.9,12,30,11.2,"NO IWS","NO IWS",2,60,1158,100,90,980,988.4,47,51.7,31,27.900000000000002,1.25,8.6355785837651119E-2,0.84628670120898097,4.0587219343696031E-2,2.6770293609671848E-2]
["C",3,0.9,12,30,11.2,1.5,45,2,60,1158,100,90,695,731.1,51,56.1,312,280.8,1.25,8.6355785837651119E-2,0.60017271157167529,4.4041450777202069E-2,0.26943005181347152]
["C",3,0.9,12,30,11.2,1.5,45,1.3,40,1158,100,90,673,708.9,63,69.300000000000011,322,289.8,1.25,8.6355785837651119E-2,0.58117443868739205,5.4404145077720206E-2,0.27806563039723664]
["C",3,0.9,12,30,11.2,1.5,45,0.6,20,1158,100,90,623,659.2,91,100.10000000000001,343,308.7,1.25,8.6355785837651119E-2,0.53799654576856648,7.8583765112262519E-2,0.29620034542314333]
["C",3,0.9,12,30,9.3000000000000007,"NO IWS","NO IWS",2,60,979,100,90,827,836.3,25,27.500000000000004,28,25.2,1.5,0.10214504596527069,0.84473953013278857,2.5536261491317672E-2,2.8600612870275793E-2]
["C",3,0.9,12,30,9.3000000000000007,1.5,45,2,60,979,100,90,552,589.29999999999995,27,29.700000000000003,300,270,1.5,0.10214504596527069,0.56384065372829417,2.7579162410623085E-2,0.30643513789581206]
["C",3,0.9,12,30,9.3000000000000007,1.5,45,1.3,40,979,100,90,538,574.4,34,37.400000000000006,308,277.2,1.5,0.10214504596527069,0.54954034729315626,3.472931562819203E-2,0.3146067415730337]
["C",3,0.9,12,30,9.3000000000000007,1.5,45,0.6,20,979,100,90,503,540.4,51,56.1,325,292.5,1.5,0.10214504596527069,0.5137895812053116,5.2093973442288048E-2,0.33197139938712972]
["C",3,0.9,12,30,7,"NO IWS","NO IWS",2,60,764,99,89.100000000000009,630,642.5,9,9.9,25,22.5,2,0.12958115183246074,0.82460732984293195,1.1780104712041885E-2,3.2722513089005235E-2]
["C",3,0.9,12,30,7,1.5,45,2,60,764,100,90,374,411,10,11,280,252,2,0.13089005235602094,0.48952879581151831,1.3089005235602094E-2,0.36649214659685864]
["C",3,0.9,12,30,7,1.5,45,1.3,40,764,100,90,365,402.1,14,15.400000000000002,285,256.5,2,0.13089005235602094,0.47774869109947643,1.832460732984293E-2,0.37303664921465968]
["C",3,0.9,12,30,7,1.5,45,0.6,20,764,100,90,347,384.9,19,20.900000000000002,298,268.2,2,0.13089005235602094,0.45418848167539266,2.4869109947643978E-2,0.3900523560209424]
["C",3,0.9,9,23,20.399999999999999,"NO IWS","NO IWS",2,60,2021,100,90,1514,1490.9,369,405.90000000000003,38,34.200000000000003,0.5,4.9480455220188027E-2,0.74913409203364667,0.18258287976249382,1.880257298367145E-2]
["C",3,0.9,9,23,20.399999999999999,1.5,45,2,60,2021,100,90,1181,1185.8,396,435.6,344,309.60000000000002,0.5,4.9480455220188027E-2,0.58436417615042058,0.19594260267194458,0.1702127659574468]
["C",3,0.9,9,23,20.399999999999999,1.5,45,1.3,40,2021,100,90,1098,1098.2,465,511.50000000000006,357,321.3,0.5,4.9480455220188027E-2,0.54329539831766449,0.23008411677387433,0.17664522513607125]
["C",3,0.9,9,23,20.399999999999999,1.5,45,0.6,20,2021,100,90,951,942.3,583,641.30000000000007,386,347.40000000000003,0.5,4.9480455220188027E-2,0.47055912914398812,0.28847105393369621,0.19099455714992578]
["C",3,0.9,9,23,13.6,"NO IWS","NO IWS",2,60,1383,100,90,1128,1129.0999999999999,122,134.20000000000002,33,29.7,0.75,7.230657989877079E-2,0.81561822125813443,8.8214027476500367E-2,2.3861171366594359E-2]
["C",3,0.9,9,23,13.6,1.5,45,2,60,1383,100,90,828,857.1,132,145.20000000000002,323,290.7,0.75,7.230657989877079E-2,0.59869848156182215,9.5444685466377438E-2,0.23355025307302965]
["C",3,0.9,9,23,13.6,1.5,45,1.3,40,1383,100,90,788,815.3,161,177.10000000000002,334,300.60000000000002,0.75,7.230657989877079E-2,0.56977584960231376,0.11641359363702097,0.24150397686189443]
["C",3,0.9,9,23,13.6,1.5,45,0.6,20,1383,100,90,706,730.59999999999991,220,242.00000000000003,356,320.40000000000003,0.75,7.230657989877079E-2,0.51048445408532173,0.15907447577729572,0.257411424439624]
["C",3,0.9,9,23,10.199999999999999,"NO IWS","NO IWS",2,60,1064,100,90,884,891.8,51,56.1,29,26.1,1,9.3984962406015032E-2,0.83082706766917291,4.7932330827067667E-2,2.7255639097744359E-2]
["C",3,0.9,9,23,10.199999999999999,1.5,45,2,60,1064,100,90,603,638.09999999999991,55,60.500000000000007,306,275.40000000000003,1,9.3984962406015032E-2,0.56672932330827064,5.1691729323308268E-2,0.28759398496240601]
["C",3,0.9,9,23,10.199999999999999,1.5,45,1.3,40,1064,100,90,581,615.5,69,75.900000000000006,314,282.60000000000002,1,9.3984962406015032E-2,0.54605263157894735,6.4849624060150379E-2,0.29511278195488722]
["C",3,0.9,9,23,10.199999999999999,1.5,45,0.6,20,1064,100,90,535,568.5,97,106.7,332,298.8,1,9.3984962406015032E-2,0.5028195488721805,9.1165413533834588E-2,0.31203007518796994]
["C",3,0.9,9,23,8.1999999999999993,"NO IWS","NO IWS",2,60,876,99,89.100000000000009,726,735.1,25,27.500000000000004,27,24.3,1.25,0.11301369863013698,0.82876712328767121,2.8538812785388126E-2,3.0821917808219176E-2]
["C",3,0.9,9,23,8.1999999999999993,1.5,45,2,60,876,100,90,458,494.4,27,29.700000000000003,291,261.90000000000003,1.25,0.11415525114155251,0.52283105022831056,3.0821917808219176E-2,0.3321917808219178]
["C",3,0.9,9,23,8.1999999999999993,1.5,45,1.3,40,876,100,90,444,480.4,34,37.400000000000006,298,268.2,1.25,0.11415525114155251,0.50684931506849318,3.8812785388127852E-2,0.34018264840182649]
["C",3,0.9,9,23,8.1999999999999993,1.5,45,0.6,20,876,100,90,415,451.29999999999995,49,53.900000000000006,312,280.8,1.25,0.11415525114155251,0.47374429223744291,5.5936073059360727E-2,0.35616438356164382]
["C",3,0.9,9,23,6.8,"NO IWS","NO IWS",2,60,745,99,89.100000000000009,608,620,13,14.3,24,21.6,1.5,0.13288590604026845,0.81610738255033555,1.74496644295302E-2,3.2214765100671144E-2]
["C",3,0.9,9,23,6.8,1.5,45,2,60,745,99,89.100000000000009,353,391.2,14,15.400000000000002,277,249.3,1.5,0.13288590604026845,0.47382550335570472,1.8791946308724831E-2,0.37181208053691273]
["C",3,0.9,9,23,6.8,1.5,45,1.3,40,745,100,90,344,379.4,19,20.900000000000002,283,254.70000000000002,1.5,0.13422818791946309,0.46174496644295304,2.5503355704697986E-2,0.37986577181208053]
["C",3,0.9,9,23,6.8,1.5,45,0.6,20,745,100,90,324,360.7,27,29.700000000000003,294,264.60000000000002,1.5,0.13422818791946309,0.43489932885906041,3.6241610738255034E-2,0.39463087248322148]
["C",3,0.9,9,23,5.0999999999999996,"NO IWS","NO IWS",2,60,585,99,89.100000000000009,461,471.5,5,5.5,21,18.900000000000002,2,0.16923076923076924,0.78803418803418801,8.5470085470085479E-3,3.5897435897435895E-2]
["C",3,0.9,9,23,5.0999999999999996,1.5,45,2,60,585,99,89.100000000000009,227,261.8,5,5.5,254,228.6,2,0.16923076923076924,0.38803418803418804,8.5470085470085479E-3,0.4341880341880342]
["C",3,0.9,9,23,5.0999999999999996,1.5,45,1.3,40,585,99,89.100000000000009,221,256,7,7.7000000000000011,258,232.20000000000002,2,0.16923076923076924,0.37777777777777777,1.1965811965811967E-2,0.44102564102564101]
["C",3,0.9,9,23,5.0999999999999996,1.5,45,0.6,20,585,99,89.100000000000009,210,245.29999999999995,11,12.100000000000001,265,238.5,2,0.16923076923076924,0.35897435897435898,1.8803418803418803E-2,0.45299145299145299]
["C",4,1.2,12,30,28,"NO IWS","NO IWS",2,60,2734,101,90.9,1958,1911.6,620,682,55,49.5,0.5,3.6942209217264085E-2,0.71616678858814919,0.22677395757132407,2.0117044623262619E-2]
["C",4,1.2,12,30,28,1.5,45,2,60,2734,101,90.9,1477,1470.1,663,729.30000000000007,493,443.7,0.5,3.6942209217264085E-2,0.54023408924652527,0.24250182882223847,0.18032187271397221]
["C",4,1.2,12,30,28,1.5,45,1.3,40,2734,101,90.9,1345,1329.3,773,850.30000000000007,515,463.5,0.5,3.6942209217264085E-2,0.49195318215069495,0.28273591806876369,0.18836869056327724]
["C",4,1.2,12,30,28,1.5,45,0.6,20,2734,101,90.9,1167,1141.4999999999998,911,1002.1000000000001,555,499.5,0.5,3.6942209217264085E-2,0.42684711046086321,0.33321141185076808,0.20299926847110461]
["C",4,1.2,12,30,18.7,"NO IWS","NO IWS",2,60,1861,101,90.9,1494,1486.1999999999998,218,239.8,49,44.1,0.75,5.4271896829661471E-2,0.80279419666845786,0.11714132186996239,2.6329930145083287E-2]
["C",4,1.2,12,30,18.7,1.5,45,2,60,1861,101,90.9,1059,1091.0999999999999,236,259.60000000000002,466,419.40000000000003,0.75,5.4271896829661471E-2,0.56904889844169804,0.12681354110693177,0.25040300913487373]
["C",4,1.2,12,30,18.7,1.5,45,1.3,40,1861,101,90.9,990,1019.7,287,315.70000000000005,483,434.7,0.75,5.4271896829661471E-2,0.53197205803331538,0.15421816227834498,0.25953788285867813]
["C",4,1.2,12,30,18.7,1.5,45,0.6,20,1861,101,90.9,883,908.4,362,398.20000000000005,515,463.5,0.75,5.4271896829661471E-2,0.47447608812466419,0.19451907576571736,0.27673293927995701]
["C",4,1.2,12,30,14,"NO IWS","NO IWS",2,60,1420,101,90.9,1184,1188.5,91,100.10000000000001,45,40.5,1,7.1126760563380284E-2,0.83380281690140845,6.4084507042253519E-2,3.1690140845070422E-2]
["C",4,1.2,12,30,14,1.5,45,2,60,1420,101,90.9,779,822.4,99,108.9,442,397.8,1,7.1126760563380284E-2,0.54859154929577469,6.9718309859154934E-2,0.31126760563380279]
["C",4,1.2,12,30,14,1.5,45,1.3,40,1420,101,90.9,739,782.1,125,137.5,455,409.5,1,7.1126760563380284E-2,0.52042253521126758,8.8028169014084501E-2,0.32042253521126762]
["C",4,1.2,12,30,14,1.5,45,0.6,20,1420,101,90.9,674,715.8,164,180.4,481,432.90000000000003,1,7.1126760563380284E-2,0.47464788732394364,0.11549295774647887,0.33873239436619718]
["C",4,1.2,12,30,11.2,"NO IWS","NO IWS",2,60,1158,101,90.9,971,980.9,44,48.400000000000006,42,37.800000000000004,1.25,8.7219343696027629E-2,0.83851468048359246,3.7996545768566495E-2,3.6269430051813469E-2]
["C",4,1.2,12,30,11.2,1.5,45,2,60,1158,101,90.9,588,636.29999999999995,48,52.800000000000004,420,378,1.25,8.7219343696027629E-2,0.50777202072538863,4.145077720207254E-2,0.36269430051813473]
["C",4,1.2,12,30,11.2,1.5,45,1.3,40,1158,101,90.9,563,611,62,68.2,431,387.90000000000003,1.25,8.7219343696027629E-2,0.48618307426597585,5.3540587219343697E-2,0.37219343696027635]
["C",4,1.2,12,30,11.2,1.5,45,0.6,20,1158,101,90.9,521,569,83,91.300000000000011,452,406.8,1.25,8.7219343696027629E-2,0.44991364421416236,7.1675302245250427E-2,0.39032815198618309]
["C",4,1.2,12,30,9.3000000000000007,"NO IWS","NO IWS",2,60,979,101,90.9,816,826.6,24,26.400000000000002,39,35.1,1.5,{"$f":"L268/K268","v":0.10316649642492338},{"$f":"N268/K268","v":0.83350357507660877},{"$f":"P268/K268","v":2.4514811031664963E-2},{"$f":"R268/K268","v":3.9836567926455568E-2}]
["C",4,1.2,12,30,9.3000000000000007,1.5,45,2,60,979,101,{"$f":"L269*0.9","v":90.9},452,{"$f":"K269-(M269+Q269+S269)","v":498.59999999999997},26,{"$f":"P269*1.1","v":28.6},401,{"$f":"0.9*R269","v":360.90000000000003},1.5,0.10316649642492338,0.46169560776302349,2.6557711950970377E-2,0.40960163432073543]
["C",4,1.2,12,30,9.3000000000000007,1.5,45,1.3,40,979,101,90.9,436,483.69999999999993,33,36.300000000000004,409,368.1,1.5,0.10316649642492338,0.44535240040858021,3.3707865168539325E-2,0.41777323799795713]
["C",4,1.2,12,30,9.3000000000000007,1.5,45,0.6,20,979,101,90.9,407,455.19999999999993,45,49.500000000000007,426,383.40000000000003,1.5,0.10316649642492338,0.4157303370786517,4.5965270684371805E-2,0.43513789581205309]
["C",4,1.2,12,30,7,"NO IWS","NO IWS",2,60,764,101,90.9,619,630.79999999999995,9,9.9,36,32.4,2,0.13219895287958114,0.81020942408376961,1.1780104712041885E-2,4.712041884816754E-2]
["C",4,1.2,12,30,7,1.5,45,2,60,764,101,90.9,286,331.79999999999995,10,11,367,330.3,2,0.13219895287958114,0.37434554973821987,1.3089005235602094E-2,0.48036649214659688]
["C",4,1.2,12,30,7,1.5,45,1.3,40,764,101,90.9,277,324,13,14.3,372,334.8,2,0.13219895287958114,0.36256544502617799,1.7015706806282723E-2,0.48691099476439792]
["C",4,1.2,12,30,7,1.5,45,0.6,20,764,101,90.9,262,308.79999999999995,17,18.700000000000003,384,345.6,2,0.13219895287958114,0.34293193717277487,2.2251308900523559E-2,0.50261780104712039]
["C",4,1.2,9,23,20.399999999999999,"NO IWS","NO IWS",2,60,2021,101,90.9,1516,1495.5,355,390.50000000000006,49,44.1,0.5,4.9975259772389903E-2,0.75012370113805049,0.17565561603166749,2.4245423057892134E-2]
["C",4,1.2,9,23,20.399999999999999,1.5,45,2,60,2021,101,90.9,1064,1083.5999999999999,385,423.50000000000006,470,423,0.5,4.9975259772389903E-2,0.52647204354280064,0.19049975259772389,0.23255813953488372]
["C",4,1.2,9,23,20.399999999999999,1.5,45,1.3,40,2021,101,90.9,979,992.39999999999986,454,499.40000000000003,487,438.3,0.5,4.9975259772389903E-2,0.48441365660564079,0.22464126669965365,0.24096981692231567]
["C",4,1.2,9,23,20.399999999999999,1.5,45,0.6,20,2021,101,90.9,851,858.5,552,607.20000000000005,516,464.40000000000003,0.5,4.9975259772389903E-2,0.42107867392380011,0.27313211281543792,0.25531914893617019]
["C",4,1.2,9,23,13.6,"NO IWS","NO IWS",2,60,1383,101,90.9,1123,1124.9000000000001,116,127.60000000000001,44,39.6,0.75,7.3029645697758494E-2,0.812002892263196,8.3875632682574114E-2,3.1814895155459148E-2]
["C",4,1.2,9,23,13.6,1.5,45,2,60,1383,101,90.9,717,759.3,126,138.60000000000002,438,394.2,0.75,7.3029645697758494E-2,0.51843817787418656,9.1106290672451198E-2,0.31670281995661603]
["C",4,1.2,9,23,13.6,1.5,45,1.3,40,1383,101,90.9,676,715.5,156,171.60000000000002,450,405,0.75,7.3029645697758494E-2,0.48879248011569054,0.11279826464208242,0.32537960954446854]
["C",4,1.2,9,23,13.6,1.5,45,0.6,20,1383,101,90.9,606,644.20000000000005,202,222.20000000000002,473,425.7,0.75,7.3029645697758494E-2,0.43817787418655096,0.14605929139551699,0.34201012292118582]
["C",4,1.2,9,23,10.199999999999999,"NO IWS","NO IWS",2,60,1064,101,90.9,875,884.3,48,52.800000000000004,40,36,1,9.492481203007519E-2,0.82236842105263153,4.5112781954887216E-2,3.7593984962406013E-2]
["C",4,1.2,9,23,10.199999999999999,1.5,45,2,60,1064,101,90.9,500,545.79999999999995,53,58.300000000000004,410,369,1,9.492481203007519E-2,0.46992481203007519,4.9812030075187967E-2,0.38533834586466165]
["C",4,1.2,9,23,10.199999999999999,1.5,45,1.3,40,1064,101,90.9,478,523.4,66,72.600000000000009,419,377.1,1,9.492481203007519E-2,0.4492481203007519,6.2030075187969921E-2,0.39379699248120303]
["C",4,1.2,9,23,10.199999999999999,1.5,45,0.6,20,1064,101,90.9,439,484.09999999999991,87,95.7,437,393.3,1,9.492481203007519E-2,0.41259398496240601,8.1766917293233085E-2,0.4107142857142857]
["C",4,1.2,9,23,8.1999999999999993,"NO IWS","NO IWS",2,60,876,101,90.9,715,726.5,23,25.3,37,33.300000000000004,1.25,0.11529680365296803,0.81621004566210043,2.6255707762557076E-2,4.2237442922374427E-2]
["C",4,1.2,9,23,8.1999999999999993,1.5,45,2,60,876,101,90.9,364,410.19999999999993,25,27.500000000000004,386,347.40000000000003,1.25,0.11529680365296803,0.41552511415525112,2.8538812785388126E-2,0.4406392694063927]
["C",4,1.2,9,23,8.1999999999999993,1.5,45,1.3,40,876,101,90.9,350,395.1,33,36.300000000000004,393,353.7,1.25,0.11529680365296803,0.3995433789954338,3.7671232876712327E-2,0.44863013698630139]
["C",4,1.2,9,23,8.1999999999999993,1.5,45,0.6,20,876,101,90.9,326,372.4,43,47.300000000000004,406,365.40000000000003,1.25,0.11529680365296803,0.37214611872146119,4.9086757990867577E-2,0.4634703196347032]
["C",4,1.2,9,23,6.8,"NO IWS","NO IWS",2,60,745,101,90.9,597,608.29999999999995,13,14.3,35,31.5,1.5,0.13557046979865772,0.80134228187919465,1.74496644295302E-2,4.6979865771812082E-2]
["C",4,1.2,9,23,6.8,1.5,45,2,60,745,101,90.9,267,312,14,15.400000000000002,363,326.7,1.5,0.13557046979865772,0.35838926174496644,1.8791946308724831E-2,0.48724832214765101]
["C",4,1.2,9,23,6.8,1.5,45,1.3,40,745,101,90.9,258,304.2,17,18.700000000000003,368,331.2,1.5,0.13557046979865772,0.34630872483221475,2.2818791946308724E-2,0.49395973154362416]
["C",4,1.2,9,23,6.8,1.5,45,0.6,20,745,101,90.9,242,288.60000000000002,23,25.3,378,340.2,1.5,0.13557046979865772,0.32483221476510066,3.087248322147651E-2,0.50738255033557045]
["C",4,1.2,9,23,5.0999999999999996,"NO IWS","NO IWS",2,60,585,101,90.9,449,460.9,4,4.4000000000000004,32,28.8,2,0.17264957264957265,0.76752136752136757,6.8376068376068376E-3,5.4700854700854701E-2]
["C",4,1.2,9,23,5.0999999999999996,1.5,45,2,60,585,101,90.9,155,197,5,5.5,324,291.60000000000002,2,0.17264957264957265,0.26495726495726496,8.5470085470085479E-3,0.55384615384615388]
["C",4,1.2,9,23,5.0999999999999996,1.5,45,1.3,40,585,101,90.9,150,191.2,7,7.7000000000000011,328,295.2,2,0.17264957264957265,0.25641025641025639,1.1965811965811967E-2,0.56068376068376069]
["C",4,1.2,9,23,5.0999999999999996,1.5,45,0.6,20,585,101,90.9,141,183.59999999999997,9,9.9,334,300.60000000000002,2,0.17264957264957265,0.24102564102564103,1.5384615384615385E-2,0.57094017094017091]
["D",3,0.9,12,30,28,"NO IWS","NO IWS",2,60,2734,100,90,1991,1936.6,639,702.90000000000009,5,4.5,0.5,3.6576444769568395E-2,0.72823701536210683,0.23372348207754207,1.8288222384784199E-3]
["D",3,0.9,12,30,28,1.5,45,2,60,2734,101,90.9,1865,1809.6,716,787.6,51,45.9,0.5,3.6942209217264085E-2,0.68215069495245062,0.2618873445501097,1.8653986832479885E-2]
["D",3,0.9,12,30,28,1.5,45,1.3,40,2734,101,90.9,1754,1686.8,826,908.6,53,47.7,0.5,3.6942209217264085E-2,0.6415508412582297,0.30212143379663497,1.9385515727871252E-2]
["D",3,0.9,12,30,28,1.5,45,0.6,20,2734,101,90.9,1546,1458.5999999999997,1031,1134.1000000000001,56,50.4,0.5,3.6942209217264085E-2,0.56547183613752738,0.37710314557425018,2.0482809070958303E-2]
["D",3,0.9,12,30,18.7,"NO IWS","NO IWS",2,60,1861,100,90,1531,1517.6999999999998,227,249.70000000000002,4,3.6,0.75,5.3734551316496508E-2,0.82267598065556158,0.12197743148844707,2.1493820526598604E-3]
["D",3,0.9,12,30,18.7,1.5,45,2,60,1861,101,90.9,1450,1439.1,260,286,50,45,0.75,5.4271896829661471E-2,0.7791509940891993,0.13970983342289092,2.6867275658248254E-2]
["D",3,0.9,12,30,18.7,1.5,45,1.3,40,1861,101,90.9,1388,1370.2,321,353.1,52,46.800000000000004,0.75,5.4271896829661471E-2,0.74583557227297148,0.17248790972595379,2.7941966684578184E-2]
["D",3,0.9,12,30,18.7,1.5,45,0.6,20,1861,101,90.9,1270,1241.9000000000001,436,479.6,54,48.6,0.75,5.4271896829661471E-2,0.6824288017195056,0.23428264373992477,2.9016657710908115E-2]
["D",3,0.9,12,30,14,"NO IWS","NO IWS",2,60,1420,100,90,1221,1220.8,96,105.60000000000001,4,3.6,1,7.0422535211267609E-2,0.85985915492957743,6.7605633802816895E-2,2.8169014084507044E-3]
["D",3,0.9,12,30,14,1.5,45,2,60,1420,101,90.9,1157,1159.8,113,124.30000000000001,50,45,1,7.1126760563380284E-2,0.81478873239436622,7.9577464788732399E-2,3.5211267605633804E-2]
["D",3,0.9,12,30,14,1.5,45,1.3,40,1420,101,90.9,1126,1125.9000000000001,143,157.30000000000001,51,45.9,1,7.1126760563380284E-2,0.79295774647887329,0.10070422535211268,3.591549295774648E-2]
["D",3,0.9,12,30,14,1.5,45,0.6,20,1420,101,90.9,1058,1052.5999999999999,208,228.8,53,47.7,1,7.1126760563380284E-2,0.74507042253521127,0.14647887323943662,3.732394366197183E-2]
["D",3,0.9,12,30,11.2,"NO IWS","NO IWS",2,60,1158,100,90,1008,1013.6,47,51.7,3,2.7,1.25,8.6355785837651119E-2,0.8704663212435233,4.0587219343696031E-2,2.5906735751295338E-3]
["D",3,0.9,12,30,11.2,1.5,45,2,60,1158,101,90.9,952,961.4,56,61.600000000000009,49,44.1,1.25,8.7219343696027629E-2,0.82210708117443865,4.8359240069084632E-2,4.231433506044905E-2]
["D",3,0.9,12,30,11.2,1.5,45,1.3,40,1158,101,90.9,934,942.9,72,79.2,50,45,1.25,8.7219343696027629E-2,0.8065630397236615,6.2176165803108807E-2,4.317789291882556E-2]
["D",3,0.9,12,30,11.2,1.5,45,0.6,20,1158,101,90.9,893,898.2,111,122.10000000000001,52,46.800000000000004,1.25,8.7219343696027629E-2,0.77115716753022456,9.585492227979274E-2,4.4905008635578586E-2]
["D",3,0.9,12,30,9.3000000000000007,"NO IWS","NO IWS",2,60,979,99,89.100000000000009,852,859.7,25,27.500000000000004,3,2.7,1.5,0.10112359550561797,0.87027579162410618,2.5536261491317672E-2,3.0643513789581204E-3]
["D",3,0.9,12,30,9.3000000000000007,1.5,45,2,60,979,101,90.9,800,811.9,30,33,48,43.2,1.5,0.10316649642492338,0.81716036772216549,3.0643513789581207E-2,4.9029622063329927E-2]
["D",3,0.9,12,30,9.3000000000000007,1.5,45,1.3,40,979,101,90.9,789,800,40,44,49,44.1,1.5,0.10316649642492338,0.80592441266598569,4.0858018386108273E-2,5.0051072522982638E-2]
["D",3,0.9,12,30,9.3000000000000007,1.5,45,0.6,20,979,101,90.9,764,772.9,63,69.300000000000011,51,45.9,1.5,0.10316649642492338,0.78038815117466798,6.4351378958120528E-2,5.2093973442288048E-2]
["D",3,0.9,12,30,7,"NO IWS","NO IWS",2,60,764,99,89.100000000000009,653,663.2,9,9.9,2,1.8,2,0.12958115183246074,0.85471204188481675,1.1780104712041885E-2,2.617801047120419E-3]
["D",3,0.9,12,30,7,1.5,45,2,60,764,101,90.9,603,616.70000000000005,12,13.200000000000001,48,43.2,2,0.13219895287958114,0.78926701570680624,1.5706806282722512E-2,6.2827225130890049E-2]
["D",3,0.9,12,30,7,1.5,45,1.3,40,764,101,90.9,599,612.29999999999995,16,17.600000000000001,48,43.2,2,0.13219895287958114,0.78403141361256545,2.0942408376963352E-2,6.2827225130890049E-2]
["D",3,0.9,12,30,7,1.5,45,0.6,20,764,101,90.9,587,600.6,25,27.500000000000004,50,45,2,0.13219895287958114,0.76832460732984298,3.2722513089005235E-2,6.5445026178010471E-2]
["D",3,0.9,9,23,20.399999999999999,"NO IWS","NO IWS",2,60,2021,100,90,1548,1521.5,369,405.90000000000003,4,3.6,0.5,4.9480455220188027E-2,0.76595744680851063,0.18258287976249382,1.9792182088075212E-3]
["D",3,0.9,9,23,20.399999999999999,1.5,45,2,60,2021,101,90.9,1451,1425.3,418,459.8,50,45,0.5,4.9975259772389903E-2,0.71796140524492824,0.20682830282038595,2.4740227610094014E-2]
["D",3,0.9,9,23,20.399999999999999,1.5,45,1.3,40,2021,101,90.9,1362,1326.7,506,556.6,52,46.800000000000004,0.5,4.9975259772389903E-2,0.67392380009896091,0.25037110341415142,2.5729836714497772E-2]
["D",3,0.9,9,23,20.399999999999999,1.5,45,0.6,20,2021,101,90.9,1214,1165.4000000000001,651,716.1,54,48.6,0.5,4.9975259772389903E-2,0.60069272637308269,0.32211776348342402,2.6719445818901535E-2]
["D",3,0.9,9,23,13.6,"NO IWS","NO IWS",2,60,1383,100,90,1158,1156.0999999999999,122,134.20000000000002,3,2.7,0.75,7.230657989877079E-2,0.83731019522776573,8.8214027476500367E-2,2.1691973969631237E-3]
["D",3,0.9,9,23,13.6,1.5,45,2,60,1383,101,90.9,1090,1091.8,142,156.20000000000002,49,44.1,0.75,7.3029645697758494E-2,0.78814172089660162,0.10267534345625452,3.5430224150397684E-2]
["D",3,0.9,9,23,13.6,1.5,45,1.3,40,1383,101,90.9,1048,1045.8,183,201.3,50,45,0.75,7.3029645697758494E-2,0.75777295733911787,0.13232104121475055,3.6153289949385395E-2]
["D",3,0.9,9,23,13.6,1.5,45,0.6,20,1383,101,90.9,970,959.5,259,284.90000000000003,53,47.7,0.75,7.3029645697758494E-2,0.70137382501807666,0.18727404193781635,3.8322487346348515E-2]
["D",3,0.9,9,23,10.199999999999999,"NO IWS","NO IWS",2,60,1064,100,90,910,915.2,51,56.1,3,2.7,1,{"$f":"L332/K332","v":9.3984962406015032E-2},{"$f":"N332/K332","v":0.85526315789473684},{"$f":"P332/K332","v":4.7932330827067667E-2},{"$f":"R332/K332","v":2.819548872180451E-3}]
["D",3,0.9,9,23,10.199999999999999,1.5,45,2,60,1064,101,{"$f":"L333*0.9","v":90.9},854,{"$f":"K333-(M333+Q333+S333)","v":863},60,{"$f":"P333*1.1","v":66},49,{"$f":"0.9*R333","v":44.1},1,9.492481203007519E-2,0.80263157894736847,5.6390977443609019E-2,4.6052631578947366E-2]
["D",3,0.9,9,23,10.199999999999999,1.5,45,1.3,40,1064,101,90.9,833,840.1,80,88,50,45,1,9.492481203007519E-2,0.78289473684210531,7.5187969924812026E-2,4.6992481203007516E-2]
["D",3,0.9,9,23,10.199999999999999,1.5,45,0.6,20,1064,101,90.9,791,795.2,120,132,51,45.9,1,9.492481203007519E-2,0.74342105263157898,0.11278195488721804,4.7932330827067667E-2]
["D",3,0.9,9,23,8.1999999999999993,"NO IWS","NO IWS",2,60,876,99,89.100000000000009,750,756.7,25,27.500000000000004,3,2.7,1.25,0.11301369863013698,0.85616438356164382,2.8538812785388126E-2,3.4246575342465752E-3]
["D",3,0.9,9,23,8.1999999999999993,1.5,45,2,60,876,101,90.9,697,708.9,30,33,48,43.2,1.25,0.11529680365296803,0.795662100456621,3.4246575342465752E-2,5.4794520547945202E-2]
["D",3,0.9,9,23,8.1999999999999993,1.5,45,1.3,40,876,101,90.9,685,695.9,41,45.1,49,44.1,1.25,0.11529680365296803,0.78196347031963476,4.6803652968036527E-2,5.5936073059360727E-2]
["D",3,0.9,9,23,8.1999999999999993,1.5,45,0.6,20,876,101,90.9,661,669.7,64,70.400000000000006,50,45,1.25,0.11529680365296803,0.75456621004566216,7.3059360730593603E-2,5.7077625570776253E-2]
["D",3,0.9,9,23,6.8,"NO IWS","NO IWS",2,60,745,99,89.100000000000009,630,639.79999999999995,13,14.3,2,1.8,1.5,0.13288590604026845,0.84563758389261745,1.74496644295302E-2,2.6845637583892616E-3]
["D",3,0.9,9,23,6.8,1.5,45,2,60,745,101,90.9,580,593.29999999999995,16,17.600000000000001,48,43.2,1.5,0.13557046979865772,0.77852348993288589,2.1476510067114093E-2,6.4429530201342289E-2]
["D",3,0.9,9,23,6.8,1.5,45,1.3,40,745,101,90.9,574,586.70000000000005,22,24.200000000000003,48,43.2,1.5,0.13557046979865772,0.77046979865771814,2.9530201342281879E-2,6.4429530201342289E-2]
["D",3,0.9,9,23,6.8,1.5,45,0.6,20,745,101,90.9,558,569.5,36,39.6,50,45,1.5,0.13557046979865772,0.74899328859060399,4.832214765100671E-2,6.7114093959731544E-2]
["D",3,0.9,9,23,5.0999999999999996,"NO IWS","NO IWS",2,60,585,99,89.100000000000009,480,488.6,5,5.5,2,1.8,2,0.16923076923076924,0.82051282051282048,8.5470085470085479E-3,3.4188034188034188E-3]
["D",3,0.9,9,23,5.0999999999999996,1.5,45,2,60,585,101,90.9,432,445.2,6,6.6000000000000005,47,42.300000000000004,2,0.17264957264957265,0.7384615384615385,1.0256410256410256E-2,8.0341880341880348E-2]
["D",3,0.9,9,23,5.0999999999999996,1.5,45,1.3,40,585,101,90.9,428,441.9,9,9.9,47,42.300000000000004,2,0.17264957264957265,0.73162393162393158,1.5384615384615385E-2,8.0341880341880348E-2]
["D",3,0.9,9,23,5.0999999999999996,1.5,45,0.6,20,585,101,90.9,422,435.5,14,15.400000000000002,48,43.2,2,0.17264957264957265,0.72136752136752136,2.3931623931623933E-2,8.2051282051282051E-2]
["D",4,1.2,12,30,28,"NO IWS","NO IWS",2,60,2734,101,90.9,2007,1955.7,620,682,6,5.4,0.5,3.6942209217264085E-2,0.73408924652523777,0.22677395757132407,2.1945866861741038E-3]
["D",4,1.2,12,30,28,1.5,45,2,60,2734,101,90.9,1856,1802.8,705,775.50000000000011,72,64.8,0.5,3.6942209217264085E-2,0.67885881492318945,0.25786393562545723,2.6335040234089245E-2]
["D",4,1.2,12,30,28,1.5,45,1.3,40,2734,101,90.9,1732,1666.8,827,909.7,74,66.600000000000009,0.5,3.6942209217264085E-2,0.63350402340892464,0.30248719824433062,2.7066569129480616E-2]
["D",4,1.2,12,30,28,1.5,45,0.6,20,2734,101,90.9,1531,1446.3,1025,1127.5,77,69.3,0.5,3.6942209217264085E-2,0.55998536942209221,0.37490855888807606,2.8163862472567667E-2]
["D",4,1.2,12,30,18.7,"NO IWS","NO IWS",2,60,1861,101,90.9,1537,1524.9,218,239.8,6,5.4,0.75,5.4271896829661471E-2,0.82590005373455133,0.11714132186996239,3.2240730789897904E-3]
["D",4,1.2,12,30,18.7,1.5,45,2,60,1861,101,90.9,1433,1424.6,256,281.60000000000002,71,63.9,0.75,5.4271896829661471E-2,0.77001612036539491,0.13756045137023107,3.8151531434712518E-2]
["D",4,1.2,12,30,18.7,1.5,45,1.3,40,1861,101,90.9,1367,1352.2,321,353.1,72,64.8,0.75,5.4271896829661471E-2,0.73455131649650729,0.17248790972595379,3.8688876947877482E-2]
["D",4,1.2,12,30,18.7,1.5,45,0.6,20,1861,101,90.9,1253,1227.4000000000001,432,475.20000000000005,75,67.5,0.75,5.4271896829661471E-2,0.6732939279957012,0.23213326168726492,4.0300913487372379E-2]
["D",4,1.2,12,30,14,"NO IWS","NO IWS",2,60,1420,101,90.9,1223,1224.5,91,100.10000000000001,5,4.5,1,7.1126760563380284E-2,0.86126760563380278,6.4084507042253519E-2,3.5211267605633804E-3]
["D",4,1.2,12,30,14,1.5,45,2,60,1420,101,90.9,1140,1146.2,109,119.9,70,63,1,7.1126760563380284E-2,0.80281690140845074,7.6760563380281685E-2,4.9295774647887321E-2]
["D",4,1.2,12,30,14,1.5,45,1.3,40,1420,101,90.9,1106,1109,142,156.20000000000002,71,63.9,1,7.1126760563380284E-2,0.77887323943661968,0.1,0.05]
["D",4,1.2,12,30,14,1.5,45,0.6,20,1420,101,90.9,1039,1035.9000000000001,206,226.60000000000002,74,66.600000000000009,1,7.1126760563380284E-2,0.73169014084507045,0.14507042253521127,5.2112676056338028E-2]
["D",4,1.2,12,30,11.2,"NO IWS","NO IWS",2,60,1158,101,90.9,1008,1014.2,44,48.400000000000006,5,4.5,1.25,8.7219343696027629E-2,0.8704663212435233,3.7996545768566495E-2,4.3177892918825561E-3]
["D",4,1.2,12,30,11.2,1.5,45,2,60,1158,101,90.9,934,947.8,52,57.2,69,62.1,1.25,8.7219343696027629E-2,0.8065630397236615,4.4905008635578586E-2,5.9585492227979271E-2]
["D",4,1.2,12,30,11.2,1.5,45,1.3,40,1158,101,90.9,914,924.9,72,79.2,70,63,1.25,8.7219343696027629E-2,0.78929188255613125,6.2176165803108807E-2,6.0449050086355788E-2]
["D",4,1.2,12,30,11.2,1.5,45,0.6,20,1158,101,90.9,875,881.5,109,119.9,73,65.7,1.25,8.7219343696027629E-2,0.75561312607944731,9.412780656303972E-2,6.3039723661485317E-2]
["D",4,1.2,12,30,9.3000000000000007,"NO IWS","NO IWS",2,60,979,101,90.9,851,857.2,24,26.400000000000002,5,4.5,1.5,0.10316649642492338,0.86925434116445355,2.4514811031664963E-2,5.1072522982635342E-3]
["D",4,1.2,12,30,9.3000000000000007,1.5,45,2,60,979,101,90.9,780,794.1,29,31.900000000000002,69,62.1,1.5,0.10316649642492338,0.79673135852911137,2.9622063329928498E-2,7.0480081716036772E-2]
["D",4,1.2,12,30,9.3000000000000007,1.5,45,1.3,40,979,101,90.9,769,781.1,40,44,70,63,1.5,0.10316649642492338,0.78549540347293156,4.0858018386108273E-2,7.1501532175689483E-2]
["D",4,1.2,12,30,9.3000000000000007,1.5,45,0.6,20,979,101,90.9,745,755.09999999999991,62,68.2,72,64.8,1.5,0.10316649642492338,0.76098059244126659,6.332992849846783E-2,7.3544433094994893E-2]
["D",4,1.2,12,30,7,"NO IWS","NO IWS",2,60,764,101,90.9,650,659.6,9,9.9,4,3.6,2,0.13219895287958114,0.85078534031413611,1.1780104712041885E-2,5.235602094240838E-3]
["D",4,1.2,12,30,7,1.5,45,2,60,764,101,90.9,584,599.79999999999995,11,12.100000000000001,68,61.2,2,0.13219895287958114,0.76439790575916233,1.4397905759162303E-2,8.9005235602094238E-2]
["D",4,1.2,12,30,7,1.5,45,1.3,40,764,101,90.9,579,595.4,15,16.5,68,61.2,2,0.13219895287958114,0.75785340314136129,1.9633507853403141E-2,8.9005235602094238E-2]
["D",4,1.2,12,30,7,1.5,45,0.6,20,764,101,90.9,568,582.6,25,27.500000000000004,70,63,2,0.13219895287958114,0.74345549738219896,3.2722513089005235E-2,9.1623036649214659E-2]
["D",4,1.2,9,23,20.399999999999999,"NO IWS","NO IWS",2,60,2021,101,90.9,1559,1534.1999999999998,355,390.50000000000006,6,5.4,0.5,4.9975259772389903E-2,0.77140029688273137,0.17565561603166749,2.9688273132112814E-3]
["D",4,1.2,9,23,20.399999999999999,1.5,45,2,60,2021,101,90.9,1435,1410.8,414,455.40000000000003,71,63.9,0.5,4.9975259772389903E-2,0.71004453240969811,0.20484908461157841,3.5131123206333499E-2]
["D",4,1.2,9,23,20.399999999999999,1.5,45,1.3,40,2021,101,90.9,1342,1309.8000000000002,505,555.5,72,64.8,0.5,4.9975259772389903E-2,0.66402770905492325,0.24987629886194954,3.5625927758535375E-2]
["D",4,1.2,9,23,20.399999999999999,1.5,45,0.6,20,2021,101,90.9,1197,1150.9000000000001,647,711.7,75,67.5,0.5,4.9975259772389903E-2,0.5922810489856507,0.32013854527461655,3.7110341415141017E-2]
["D",4,1.2,9,23,13.6,"NO IWS","NO IWS",2,60,1383,101,90.9,1161,1160,116,127.60000000000001,5,4.5,0.75,7.3029645697758494E-2,0.83947939262472882,8.3875632682574114E-2,3.6153289949385392E-3]
["D",4,1.2,9,23,13.6,1.5,45,2,60,1383,101,90.9,1073,1076.2,139,152.9,70,63,0.75,7.3029645697758494E-2,0.7758496023138105,0.1005061460592914,5.061460592913955E-2]
["D",4,1.2,9,23,13.6,1.5,45,1.3,40,1383,101,90.9,1028,1026.9000000000001,183,201.3,71,63.9,0.75,7.3029645697758494E-2,0.74331164135936367,0.13232104121475055,5.1337671728127261E-2]
["D",4,1.2,9,23,13.6,1.5,45,0.6,20,1383,101,90.9,952,943.7,257,282.70000000000005,73,65.7,0.75,7.3029645697758494E-2,0.68835864063629792,0.18582791033984092,5.2783803326102677E-2]
["D",4,1.2,9,23,10.199999999999999,"NO IWS","NO IWS",2,60,1064,101,90.9,910,915.8,48,52.800000000000004,5,4.5,1,9.492481203007519E-2,0.85526315789473684,4.5112781954887216E-2,4.6992481203007516E-3]
["D",4,1.2,9,23,10.199999999999999,1.5,45,2,60,1064,101,90.9,835,846.1,59,64.900000000000006,69,62.1,1,9.492481203007519E-2,0.78477443609022557,5.5451127819548869E-2,6.4849624060150379E-2]
["D",4,1.2,9,23,10.199999999999999,1.5,45,1.3,40,1064,101,90.9,814,823.2,79,86.9,70,63,1,9.492481203007519E-2,0.76503759398496241,7.4248120300751883E-2,6.5789473684210523E-2]
["D",4,1.2,9,23,10.199999999999999,1.5,45,0.6,20,1064,101,90.9,772,777.4,119,130.9,72,64.8,1,9.492481203007519E-2,0.72556390977443608,0.1118421052631579,6.7669172932330823E-2]
["D",4,1.2,9,23,8.1999999999999993,"NO IWS","NO IWS",2,60,876,101,90.9,748,756.2,23,25.3,4,3.6,1.25,0.11529680365296803,0.85388127853881279,2.6255707762557076E-2,4.5662100456621002E-3]
["D",4,1.2,9,23,8.1999999999999993,1.5,45,2,60,876,101,90.9,677,692,29,31.900000000000002,68,61.2,1.25,0.11529680365296803,0.77283105022831056,3.3105022831050226E-2,7.7625570776255703E-2]
["D",4,1.2,9,23,8.1999999999999993,1.5,45,1.3,40,876,101,90.9,665,679,40,44,69,62.1,1.25,0.11529680365296803,0.7591324200913242,4.5662100456621002E-2,7.8767123287671229E-2]
["D",4,1.2,9,23,8.1999999999999993,1.5,45,0.6,20,876,101,90.9,641,651.9,63,69.300000000000011,71,63.9,1.25,0.11529680365296803,0.7317351598173516,7.1917808219178078E-2,8.1050228310502279E-2]
["D",4,1.2,9,23,6.8,"NO IWS","NO IWS",2,60,745,101,90.9,628,636.20000000000005,13,14.3,4,3.6,1.5,0.13557046979865772,0.84295302013422824,1.74496644295302E-2,5.3691275167785232E-3]
["D",4,1.2,9,23,6.8,1.5,45,2,60,745,101,90.9,560,575.29999999999995,16,17.600000000000001,68,61.2,1.5,0.13557046979865772,0.75167785234899331,2.1476510067114093E-2,9.1275167785234895E-2]
["D",4,1.2,9,23,6.8,1.5,45,1.3,40,745,101,90.9,554,569.79999999999995,21,23.1,68,61.2,1.5,0.13557046979865772,0.74362416107382545,2.8187919463087248E-2,9.1275167785234895E-2]
["D",4,1.2,9,23,6.8,1.5,45,0.6,20,745,101,90.9,539,552.6,35,38.5,70,63,1.5,0.13557046979865772,0.72348993288590602,4.6979865771812082E-2,9.3959731543624164E-2]
["D",4,1.2,9,23,5.0999999999999996,"NO IWS","NO IWS",2,60,585,101,90.9,477,486.1,4,4.4000000000000004,4,3.6,2,0.17264957264957265,0.81538461538461537,6.8376068376068376E-3,6.8376068376068376E-3]
["D",4,1.2,9,23,5.0999999999999996,1.5,45,2,60,585,101,90.9,411,427,7,7.7000000000000011,66,59.4,2,0.17264957264957265,0.70256410256410251,1.1965811965811967E-2,0.11282051282051282]
["D",4,1.2,9,23,5.0999999999999996,1.5,45,1.3,40,585,101,90.9,409,423.9,9,9.9,67,60.300000000000004,2,0.17264957264957265,0.6991452991452991,1.5384615384615385E-2,0.11452991452991453]
["D",4,1.2,9,23,5.0999999999999996,1.5,45,0.6,20,585,101,90.9,403,418.6,13,14.3,68,61.2,2,0.17264957264957265,0.68888888888888888,2.2222222222222223E-2,0.11623931623931624]
["D",5,1.5,12,30,28,"NO IWS","NO IWS",2,60,2734,100,90,2014,1963,615,676.5,5,4.5,null,{"$f":"L396/K396","v":3.6576444769568395E-2},{"$f":"N396/K396","v":0.73664959765910754},{"$f":"P396/K396","v":0.22494513533284566},{"$f":"R396/K396","v":1.8288222384784199E-3}]
["D",5,1.5,12,30,28,1.5,45,2,60,2734,101,{"$f":"L397*0.9","v":90.9},1839,{"$f":"K397-(M397+Q397+S397)","v":1788.3},701,{"$f":"P397*1.1","v":771.1},93,{"$f":"0.9*R397","v":83.7},null,3.6942209217264085E-2,0.67264081931236286,0.25640087783467447,3.4016093635698609E-2]
["D",5,1.5,12,30,28,1.5,45,1.3,40,2734,101,90.9,1720,1657.6,819,900.90000000000009,94,84.600000000000009,null,3.6942209217264085E-2,0.62911485003657641,0.29956108266276515,3.4381858083394293E-2]
["D",5,1.5,12,30,28,1.5,45,0.6,20,2734,101,90.9,1514,1431.7999999999997,1021,1123.1000000000001,98,88.2,null,3.6942209217264085E-2,0.55376737381126551,0.37344550109729335,3.5844915874177027E-2]
["D",5,1.5,12,30,18.7,"NO IWS","NO IWS",2,60,1861,100,90,1542,1530.9,215,236.50000000000003,4,3.6,null,5.3734551316496508E-2,0.82858678130037611,0.1155292853304675,2.1493820526598604E-3]
["D",5,1.5,12,30,18.7,1.5,45,2,60,1861,101,90.9,1414,1406.8,255,280.5,92,82.8,null,5.4271896829661471E-2,0.75980655561526056,0.13702310585706609,4.9435787211176786E-2]
["D",5,1.5,12,30,18.7,1.5,45,1.3,40,1861,101,90.9,1351,1338.8,316,347.6,93,83.7,null,5.4271896829661471E-2,0.72595378828586776,0.16980118216012896,4.997313272434175E-2]
["D",5,1.5,12,30,18.7,1.5,45,0.6,20,1861,101,90.9,1236,1212.9000000000001,428,470.8,96,86.4,null,5.4271896829661471E-2,0.66415905427189681,0.22998387963460504,5.1585169263836647E-2]
["D",5,1.5,12,30,14,"NO IWS","NO IWS",2,60,1420,100,90,1227,1227.4000000000001,90,99.000000000000014,4,3.6,null,7.0422535211267609E-2,0.86408450704225348,6.3380281690140844E-2,2.8169014084507044E-3]
["D",5,1.5,12,30,14,1.5,45,2,60,1420,101,90.9,1120,1128.4000000000001,108,118.80000000000001,91,81.900000000000006,null,7.1126760563380284E-2,0.78873239436619713,7.605633802816901E-2,6.4084507042253519E-2]
["D",5,1.5,12,30,14,1.5,45,1.3,40,1420,101,90.9,1088,1092.3,140,154,92,82.8,null,7.1126760563380284E-2,0.76619718309859153,9.8591549295774641E-2,6.4788732394366194E-2]
["D",5,1.5,12,30,14,1.5,45,0.6,20,1420,101,90.9,1021,1020.0999999999999,204,224.4,94,84.600000000000009,null,7.1126760563380284E-2,0.71901408450704229,0.14366197183098592,6.6197183098591544E-2]
["D",5,1.5,12,30,11.2,"NO IWS","NO IWS",2,60,1158,100,90,1011,1016.9,44,48.400000000000006,3,2.7,null,8.6355785837651119E-2,0.87305699481865284,3.7996545768566495E-2,2.5906735751295338E-3]
["D",5,1.5,12,30,11.2,1.5,45,2,60,1158,101,90.9,914,927.8,53,58.300000000000004,90,81,null,8.7219343696027629E-2,0.78929188255613125,4.5768566493955096E-2,7.7720207253886009E-2]
["D",5,1.5,12,30,11.2,1.5,45,1.3,40,1158,101,90.9,895,907.1,71,78.100000000000009,91,81.900000000000006,null,8.7219343696027629E-2,0.77288428324697755,6.1312607944732297E-2,7.8583765112262519E-2]
["D",5,1.5,12,30,11.2,1.5,45,0.6,20,1158,101,90.9,856,864.59999999999991,108,118.80000000000001,93,83.7,null,8.7219343696027629E-2,0.73920552677029361,9.3264248704663211E-2,8.0310880829015538E-2]
["D",5,1.5,12,30,9.3000000000000007,"NO IWS","NO IWS",2,60,979,99,89.100000000000009,854,861.9,23,25.3,3,2.7,null,0.10112359550561797,0.87231869254341166,2.3493360572012258E-2,3.0643513789581204E-3]
["D",5,1.5,12,30,9.3000000000000007,1.5,45,2,60,979,101,90.9,760,776.09999999999991,29,31.900000000000002,89,80.100000000000009,null,0.10316649642492338,0.77630234933605724,2.9622063329928498E-2,9.0909090909090912E-2]
["D",5,1.5,12,30,9.3000000000000007,1.5,45,1.3,40,979,101,90.9,750,764.2,39,42.900000000000006,90,81,null,0.10316649642492338,0.76608784473953018,3.9836567926455568E-2,9.193054136874361E-2]
["D",5,1.5,12,30,9.3000000000000007,1.5,45,0.6,20,979,101,90.9,725,738.2,61,67.100000000000009,92,82.8,null,0.10316649642492338,0.74055158324821246,6.2308478038815118E-2,9.3973442288049033E-2]
["D",5,1.5,12,30,7,"NO IWS","NO IWS",2,60,764,99,89.100000000000009,654,662.3,9,9.9,3,2.7,null,0.12958115183246074,0.85602094240837701,1.1780104712041885E-2,3.9267015706806281E-3]
["D",5,1.5,12,30,7,1.5,45,2,60,764,101,90.9,564,581.79999999999995,11,12.100000000000001,88,79.2,null,0.13219895287958114,0.73821989528795806,1.4397905759162303E-2,0.11518324607329843]
["D",5,1.5,12,30,7,1.5,45,1.3,40,764,101,90.9,559,576.5,15,16.5,89,80.100000000000009,null,0.13219895287958114,0.73167539267015702,1.9633507853403141E-2,0.11649214659685864]
["D",5,1.5,12,30,7,1.5,45,0.6,20,764,101,90.9,548,565.70000000000005,24,26.400000000000002,90,81,null,0.13219895287958114,0.7172774869109948,3.1413612565445025E-2,0.11780104712041885]
["D",5,1.5,9,23,20.399999999999999,"NO IWS","NO IWS",2,60,2021,100,90,1565,1540.1999999999998,352,387.20000000000005,4,3.6,null,4.9480455220188027E-2,0.77436912419594262,0.17417120237506184,1.9792182088075212E-3]
["D",5,1.5,9,23,20.399999999999999,1.5,45,2,60,2021,101,90.9,1417,1395.2,411,452.1,92,82.8,null,4.9975259772389903E-2,0.70113805047006428,0.20336467095497279,4.5522018802572985E-2]
["D",5,1.5,9,23,20.399999999999999,1.5,45,1.3,40,2021,101,90.9,1326,1295.3,501,551.1,93,83.7,null,4.9975259772389903E-2,0.65611083621969324,0.247897080653142,4.6016823354774861E-2]
["D",5,1.5,9,23,20.399999999999999,1.5,45,0.6,20,2021,101,90.9,1181,1136.4000000000001,643,707.30000000000007,96,86.4,null,4.9975259772389903E-2,0.58436417615042058,0.31815932706580902,4.7501237011380502E-2]
["D",5,1.5,9,23,13.6,"NO IWS","NO IWS",2,60,1383,100,90,1165,1162.9000000000001,115,126.50000000000001,4,3.6,null,7.230657989877079E-2,0.84237165582067963,8.315256688358641E-2,2.8922631959508315E-3]
["D",5,1.5,9,23,13.6,1.5,45,2,60,1383,101,90.9,1053,1058.2,139,152.9,90,81,null,7.3029645697758494E-2,0.76138828633405642,0.1005061460592914,6.5075921908893705E-2]
["D",5,1.5,9,23,13.6,1.5,45,1.3,40,1383,101,90.9,1010,1011.3,180,198.00000000000003,92,82.8,null,7.3029645697758494E-2,0.73029645697758494,0.13015184381778741,6.6522053506869128E-2]
["D",5,1.5,9,23,13.6,1.5,45,0.6,20,1383,101,90.9,934,928.09999999999991,254,279.40000000000003,94,84.600000000000009,null,7.3029645697758494E-2,0.67534345625451919,0.18365871294287781,6.7968185104844536E-2]
["D",5,1.5,9,23,10.199999999999999,"NO IWS","NO IWS",2,60,1064,100,90,914,919.6,47,51.7,3,2.7,null,9.3984962406015032E-2,0.85902255639097747,4.4172932330827065E-2,2.819548872180451E-3]
["D",5,1.5,9,23,10.199999999999999,1.5,45,2,60,1064,101,90.9,814,828.09999999999991,59,64.900000000000006,89,80.100000000000009,null,9.492481203007519E-2,0.76503759398496241,5.5451127819548869E-2,8.3646616541353386E-2]
["D",5,1.5,9,23,10.199999999999999,1.5,45,1.3,40,1064,101,90.9,795,806.3,78,85.800000000000011,90,81,null,9.492481203007519E-2,0.7471804511278195,7.3308270676691725E-2,8.4586466165413529E-2]
["D",5,1.5,9,23,10.199999999999999,1.5,45,0.6,20,1064,101,90.9,753,761.59999999999991,117,128.70000000000002,92,82.8,null,9.492481203007519E-2,0.70770676691729328,0.10996240601503759,8.646616541353383E-2]
["D",5,1.5,9,23,8.1999999999999993,"NO IWS","NO IWS",2,60,876,99,89.100000000000009,751,758.9,23,25.3,3,2.7,null,0.11301369863013698,0.85730593607305938,2.6255707762557076E-2,3.4246575342465752E-3]
["D",5,1.5,9,23,8.1999999999999993,1.5,45,2,60,876,101,90.9,658,673.09999999999991,29,31.900000000000002,89,80.100000000000009,null,0.11529680365296803,0.75114155251141557,3.3105022831050226E-2,0.10159817351598173]
["D",5,1.5,9,23,8.1999999999999993,1.5,45,1.3,40,876,101,90.9,646,661,40,44,89,80.100000000000009,null,0.11529680365296803,0.73744292237442921,4.5662100456621002E-2,0.10159817351598173]
["D",5,1.5,9,23,8.1999999999999993,1.5,45,0.6,20,876,101,90.9,623,636.1,61,67.100000000000009,91,81.900000000000006,null,0.11529680365296803,0.71118721461187218,6.9634703196347028E-2,0.10388127853881278]
["D",5,1.5,9,23,6.8,"NO IWS","NO IWS",2,60,745,99,89.100000000000009,631,640,12,13.200000000000001,3,2.7,null,0.13288590604026845,0.84697986577181206,1.6107382550335572E-2,4.0268456375838931E-3]
["D",5,1.5,9,23,6.8,1.5,45,2,60,745,101,90.9,540,557.29999999999995,16,17.600000000000001,88,79.2,null,0.13557046979865772,0.72483221476510062,2.1476510067114093E-2,0.11812080536912752]
["D",5,1.5,9,23,6.8,1.5,45,1.3,40,745,101,90.9,534,551.79999999999995,21,23.1,88,79.2,null,0.13557046979865772,0.71677852348993287,2.8187919463087248E-2,0.11812080536912752]
["D",5,1.5,9,23,6.8,1.5,45,0.6,20,745,101,90.9,519,534.6,35,38.5,90,81,null,0.13557046979865772,0.69664429530201344,4.6979865771812082E-2,0.12080536912751678]
["D",5,1.5,9,23,5.0999999999999996,"NO IWS","NO IWS",2,60,585,99,89.100000000000009,480,489.7,4,4.4000000000000004,2,1.8,null,0.16923076923076924,0.82051282051282048,6.8376068376068376E-3,3.4188034188034188E-3]
["D",5,1.5,9,23,5.0999999999999996,1.5,45,2,60,585,101,90.9,392,409,7,7.7000000000000011,86,77.400000000000006,null,0.17264957264957265,0.67008547008547004,1.1965811965811967E-2,0.14700854700854701]
["D",5,1.5,9,23,5.0999999999999996,1.5,45,1.3,40,585,101,90.9,390,407,8,8.8000000000000007,87,78.3,null,0.17264957264957265,0.66666666666666663,1.3675213675213675E-2,0.14871794871794872]
["D",5,1.5,9,23,5.0999999999999996,1.5,45,0.6,20,585,101,90.9,384,400.6,13,14.3,88,79.2,null,0.17264957264957265,0.65641025641025641,2.2222222222222223E-2,0.15042735042735042]

{"sheet":"All_Graphs","index":3,"n_rows":12,"n_cols":1,"rows_kept":12,"cut":false,"hidden":true,"merged":[]}
[]
[]
[]
[]
[]
[]
[]
[]
[]
[]
[]
["ou"]

{"sheet":"A-2ft","index":4,"n_rows":50,"n_cols":16,"rows_kept":50,"cut":false,"hidden":true,"merged":[]}
[null,null,null,null,null,null,null,"Runoff","ET","Drainage","Overflow","Exfiltration"]
["Soil Type","Media Depth","Surf Storage","Area Ratio","Top of IWS","DC","Area Ratio","Rainfall","ET","Drainage","Runoff","VertSeepage","ET","Drainage","Overflow","Exfiltration"]
["A",2,30,28,"none",60,0.5,2734,100,1055,651,927,{"$f":"I3/H3","v":3.6576444769568395E-2},{"$f":"J3/H3","v":0.38588149231894658},{"$f":"K3/H3","v":0.23811265544989027},{"$f":"L3/H3","v":0.33906364301389907}]
["A",2,30,28,30,60,0.5,2734,100,0,651,1984,3.6576444769568395E-2,0,0.23811265544989027,0.72567666422823707]
["A",2,30,28,30,40,0.5,2734,100,0,651,1984,3.6576444769568395E-2,0,0.23811265544989027,0.72567666422823707]
["A",2,30,28,30,20,0.5,2734,100,0,651,1984,3.6576444769568395E-2,0,0.23811265544989027,0.72567666422823707]
["A",2,30,18.7,"none",60,0.75,1861,100,781,233,747,5.3734551316496508E-2,0.41966684578183772,0.12520150456743687,0.40139709833422893]
["A",2,30,18.7,30,60,0.75,1861,100,0,233,1529,5.3734551316496508E-2,0,0.12520150456743687,0.82160128962923162]
["A",2,30,18.7,30,40,0.75,1861,100,0,233,1529,5.3734551316496508E-2,0,0.12520150456743687,0.82160128962923162]
["A",2,30,18.7,30,20,0.75,1861,100,0,233,1529,5.3734551316496508E-2,0,0.12520150456743687,0.82160128962923162]
["A",2,30,14,"none",60,1,1420,100,597,99,624,7.0422535211267609E-2,0.4204225352112676,6.9718309859154934E-2,0.43943661971830988]
["A",2,30,14,30,60,1,1420,100,0,99,1222,7.0422535211267609E-2,0,6.9718309859154934E-2,0.8605633802816901]
["A",2,30,14,30,40,1,1420,100,0,99,1222,7.0422535211267609E-2,0,6.9718309859154934E-2,0.8605633802816901]
["A",2,30,14,30,20,1,1420,100,0,99,1222,7.0422535211267609E-2,0,6.9718309859154934E-2,0.8605633802816901]
["A",2,30,11.2,"none",60,1.25,1158,100,471,49,538,8.6355785837651119E-2,0.40673575129533679,4.231433506044905E-2,0.46459412780656306]
["A",2,30,11.2,30,60,1.25,1158,100,0,49,1009,8.6355785837651119E-2,0,4.231433506044905E-2,0.87132987910189985]
["A",2,30,11.2,30,40,1.25,1158,100,0,49,1009,8.6355785837651119E-2,0,4.231433506044905E-2,0.87132987910189985]
["A",2,30,11.2,30,20,1.25,1158,100,0,49,1009,8.6355785837651119E-2,0,4.231433506044905E-2,0.87132987910189985]
["A",2,30,9.3000000000000007,"none",60,1.5,979,99,381,26,473,0.10112359550561797,0.3891726251276813,2.6557711950970377E-2,0.48314606741573035]
["A",2,30,9.3000000000000007,30,60,1.5,979,99,0,26,854,0.10112359550561797,0,2.6557711950970377E-2,0.87231869254341166]
["A",2,30,9.3000000000000007,30,40,1.5,979,99,0,26,854,0.10112359550561797,0,2.6557711950970377E-2,0.87231869254341166]
["A",2,30,9.3000000000000007,30,20,1.5,979,99,0,26,854,0.10112359550561797,0,2.6557711950970377E-2,0.87231869254341166]
["A",2,30,7,"none",60,2,764,99,269,10,386,0.12958115183246074,0.35209424083769636,1.3089005235602094E-2,0.50523560209424079]
["A",2,30,7,30,60,2,764,99,0,10,655,0.12958115183246074,0,1.3089005235602094E-2,0.85732984293193715]
["A",2,30,7,30,40,2,764,99,0,10,655,0.12958115183246074,0,1.3089005235602094E-2,0.85732984293193715]
["A",2,30,7,30,20,2,764,99,0,10,655,0.12958115183246074,0,1.3089005235602094E-2,0.85732984293193715]
["A",2,23,20.399999999999999,"none",60,0.5,2021,100,788,378,754,4.9480455220188027E-2,0.38990598713508162,0.18703612073231074,0.37308263236021771]
["A",2,23,20.399999999999999,30,60,0.5,2021,100,0,378,1544,4.9480455220188027E-2,0,0.18703612073231074,0.7639782285997031]
["A",2,23,20.399999999999999,30,40,0.5,2021,100,0,378,1544,4.9480455220188027E-2,0,0.18703612073231074,0.7639782285997031]
["A",2,23,20.399999999999999,30,20,0.5,2021,100,0,378,1544,4.9480455220188027E-2,0,0.18703612073231074,0.7639782285997031]
["A",2,23,13.6,"none",60,0.75,1383,100,558,126,599,7.230657989877079E-2,0.40347071583514099,9.1106290672451198E-2,0.43311641359363701]
["A",2,23,13.6,30,60,0.75,1383,100,0,126,1157,7.230657989877079E-2,0,9.1106290672451198E-2,0.836587129428778]
["A",2,23,13.6,30,40,0.75,1383,100,0,126,1157,7.230657989877079E-2,0,9.1106290672451198E-2,0.836587129428778]
["A",2,23,13.6,30,20,0.75,1383,100,0,126,1157,7.230657989877079E-2,0,9.1106290672451198E-2,0.836587129428778]
["A",2,23,10.199999999999999,"none",60,1,1064,100,414,53,497,9.3984962406015032E-2,0.38909774436090228,4.9812030075187967E-2,0.46710526315789475]
["A",2,23,10.199999999999999,30,60,1,1064,100,0,53,911,9.3984962406015032E-2,0,4.9812030075187967E-2,0.85620300751879697]
["A",2,23,10.199999999999999,30,40,1,1064,100,0,53,911,9.3984962406015032E-2,0,4.9812030075187967E-2,0.85620300751879697]
["A",2,23,10.199999999999999,30,20,1,1064,100,0,53,911,9.3984962406015032E-2,0,4.9812030075187967E-2,0.85620300751879697]
["A",2,23,8.1999999999999993,"none",60,1.25,876,99,322,26,429,0.11301369863013698,0.36757990867579909,2.9680365296803651E-2,0.48972602739726029]
["A",2,23,8.1999999999999993,30,60,1.25,876,99,0,26,751,0.11301369863013698,0,2.9680365296803651E-2,0.85730593607305938]
["A",2,23,8.1999999999999993,30,40,1.25,876,99,0,26,751,0.11301369863013698,0,2.9680365296803651E-2,0.85730593607305938]
["A",2,23,8.1999999999999993,30,20,1.25,876,99,0,26,751,0.11301369863013698,0,2.9680365296803651E-2,0.85730593607305938]
["A",2,23,6.8,"none",60,1.5,745,99,256,14,376,0.13288590604026845,0.34362416107382548,1.8791946308724831E-2,0.50469798657718123]
["A",2,23,6.8,30,60,1.5,745,99,0,14,632,0.13288590604026845,0,1.8791946308724831E-2,0.84832214765100666]
["A",2,23,6.8,30,40,1.5,745,99,0,14,632,0.13288590604026845,0,1.8791946308724831E-2,0.84832214765100666]
["A",2,23,6.8,30,20,1.5,745,99,0,14,632,0.13288590604026845,0,1.8791946308724831E-2,0.84832214765100666]
["A",2,23,5.0999999999999996,"none",60,2,585,99,176,5,305,0.16923076923076924,0.30085470085470084,8.5470085470085479E-3,0.5213675213675214]
["A",2,23,5.0999999999999996,30,60,2,585,99,0,5,481,0.16923076923076924,0,8.5470085470085479E-3,0.82222222222222219]
["A",2,23,5.0999999999999996,30,40,2,585,99,0,5,481,0.16923076923076924,0,8.5470085470085479E-3,0.82222222222222219]
["A",2,23,5.0999999999999996,30,20,2,585,99,0,5,481,0.16923076923076924,0,8.5470085470085479E-3,0.82222222222222219]

{"sheet":"A-3ft","index":5,"n_rows":50,"n_cols":16,"rows_kept":50,"cut":false,"hidden":true,"merged":[]}
[null,null,null,null,null,null,null,"Runoff","ET","Drainage","Overflow","Exfiltration"]
["Soil Type","Media Depth","Surf Storage","Area Ratio","Top of IWS","DC","Area Ratio","Rainfall","ET","Drainage","Runoff","VertSeepage","ET","Drainage","Overflow","Exfiltration"]
["A",3,30,28,"none",60,0.5,2734,100,1095,636,902,{"$f":"I3/H3","v":3.6576444769568395E-2},{"$f":"J3/H3","v":0.40051207022677393},{"$f":"K3/H3","v":0.23262618873445501},{"$f":"L3/H3","v":0.32991953182150696}]
["A",3,30,28,30,60,0.5,2734,100,0,633,2004,3.6576444769568395E-2,0,0.23152889539136795,0.73299195318215071]
["A",3,30,28,30,40,0.5,2734,100,0,633,2004,3.6576444769568395E-2,0,0.23152889539136795,0.73299195318215071]
["A",3,30,28,30,20,0.5,2734,100,0,633,2004,3.6576444769568395E-2,0,0.23152889539136795,0.73299195318215071]
["A",3,30,18.7,"none",60,0.75,1861,100,813,226,722,5.3734551316496508E-2,0.4368619022031166,0.12144008597528211,0.38796346050510477]
["A",3,30,18.7,30,60,0.75,1861,100,0,224,1539,5.3734551316496508E-2,0,0.12036539494895218,0.82697474476088129]
["A",3,30,18.7,30,40,0.75,1861,100,0,224,1539,5.3734551316496508E-2,0,0.12036539494895218,0.82697474476088129]
["A",3,30,18.7,30,20,0.75,1861,100,0,224,1539,5.3734551316496508E-2,0,0.12036539494895218,0.82697474476088129]
["A",3,30,14,"none",60,1,1420,100,623,96,601,7.0422535211267609E-2,0.43873239436619721,6.7605633802816895E-2,0.4232394366197183]
["A",3,30,14,30,60,1,1420,100,0,95,1227,7.0422535211267609E-2,0,6.6901408450704219E-2,0.86408450704225348]
["A",3,30,14,30,40,1,1420,100,0,95,1227,7.0422535211267609E-2,0,6.6901408450704219E-2,0.86408450704225348]
["A",3,30,14,30,20,1,1420,100,0,95,1227,7.0422535211267609E-2,0,6.6901408450704219E-2,0.86408450704225348]
["A",3,30,11.2,"none",60,1.25,1158,100,495,47,516,8.6355785837651119E-2,0.42746113989637308,4.0587219343696031E-2,0.44559585492227977]
["A",3,30,11.2,30,60,1.25,1158,100,0,46,1012,8.6355785837651119E-2,0,3.9723661485319514E-2,0.87392055267702939]
["A",3,30,11.2,30,40,1.25,1158,100,0,46,1012,8.6355785837651119E-2,0,3.9723661485319514E-2,0.87392055267702939]
["A",3,30,11.2,30,20,1.25,1158,100,0,46,1012,8.6355785837651119E-2,0,3.9723661485319514E-2,0.87392055267702939]
["A",3,30,9.3000000000000007,"none",60,1.5,979,100,402,25,453,0.10214504596527069,0.41062308478038817,2.5536261491317672E-2,0.46271705822267623]
["A",3,30,9.3000000000000007,30,60,1.5,979,99,0,24,856,0.10112359550561797,0,2.4514811031664963E-2,0.87436159346271702]
["A",3,30,9.3000000000000007,30,40,1.5,979,99,0,24,856,0.10112359550561797,0,2.4514811031664963E-2,0.87436159346271702]
["A",3,30,9.3000000000000007,30,20,1.5,979,99,0,24,856,0.10112359550561797,0,2.4514811031664963E-2,0.87436159346271702]
["A",3,30,7,"none",60,2,764,100,286,9,369,0.13089005235602094,0.37434554973821987,1.1780104712041885E-2,0.48298429319371727]
["A",3,30,7,30,60,2,764,99,0,9,655,0.12958115183246074,0,1.1780104712041885E-2,0.85732984293193715]
["A",3,30,7,30,40,2,764,99,0,9,655,0.12958115183246074,0,1.1780104712041885E-2,0.85732984293193715]
["A",3,30,7,30,20,2,764,99,0,9,655,0.12958115183246074,0,1.1780104712041885E-2,0.85732984293193715]
["A",3,23,20.399999999999999,"none",60,0.5,2021,100,823,367,730,4.9480455220188027E-2,0.40722414646214744,0.18159327065809006,0.36120732310737258]
["A",3,23,20.399999999999999,30,60,0.5,2021,100,0,365,1559,4.9480455220188027E-2,0,0.18060366155368629,0.77140029688273137]
["A",3,23,20.399999999999999,30,40,0.5,2021,100,0,365,1559,4.9480455220188027E-2,0,0.18060366155368629,0.77140029688273137]
["A",3,23,20.399999999999999,30,20,0.5,2021,100,0,365,1559,4.9480455220188027E-2,0,0.18060366155368629,0.77140029688273137]
["A",3,23,13.6,"none",60,0.75,1383,100,585,121,577,7.230657989877079E-2,0.42299349240780909,8.7490961677512649E-2,0.41720896601590746]
["A",3,23,13.6,30,60,0.75,1383,100,0,120,1164,7.230657989877079E-2,0,8.6767895878524945E-2,0.84164859002169201]
["A",3,23,13.6,30,40,0.75,1383,100,0,120,1164,7.230657989877079E-2,0,8.6767895878524945E-2,0.84164859002169201]
["A",3,23,13.6,30,20,0.75,1383,100,0,120,1164,7.230657989877079E-2,0,8.6767895878524945E-2,0.84164859002169201]
["A",3,23,10.199999999999999,"none",60,1,1064,100,436,51,477,9.3984962406015032E-2,0.40977443609022557,4.7932330827067667E-2,0.44830827067669171]
["A",3,23,10.199999999999999,30,60,1,1064,100,0,50,915,9.3984962406015032E-2,0,4.6992481203007516E-2,0.85996240601503759]
["A",3,23,10.199999999999999,30,40,1,1064,100,0,50,915,9.3984962406015032E-2,0,4.6992481203007516E-2,0.85996240601503759]
["A",3,23,10.199999999999999,30,20,1,1064,100,0,50,915,9.3984962406015032E-2,0,4.6992481203007516E-2,0.85996240601503759]
["A",3,23,8.1999999999999993,"none",60,1.25,876,100,342,25,410,0.11415525114155251,0.3904109589041096,2.8538812785388126E-2,0.4680365296803653]
["A",3,23,8.1999999999999993,30,60,1.25,876,99,0,24,753,0.11301369863013698,0,2.7397260273972601E-2,0.8595890410958904]
["A",3,23,8.1999999999999993,30,40,1.25,876,99,0,24,753,0.11301369863013698,0,2.7397260273972601E-2,0.8595890410958904]
["A",3,23,8.1999999999999993,30,20,1.25,876,99,0,24,753,0.11301369863013698,0,2.7397260273972601E-2,0.8595890410958904]
["A",3,23,6.8,"none",60,1.5,745,100,273,13,359,0.13422818791946309,0.36644295302013424,1.74496644295302E-2,0.48187919463087248]
["A",3,23,6.8,30,60,1.5,745,99,0,13,633,0.13288590604026845,0,1.74496644295302E-2,0.84966442953020138]
["A",3,23,6.8,30,40,1.5,745,99,0,13,633,0.13288590604026845,0,1.74496644295302E-2,0.84966442953020138]
["A",3,23,6.8,30,20,1.5,745,99,0,13,633,0.13288590604026845,0,1.74496644295302E-2,0.84966442953020138]
["A",3,23,5.0999999999999996,"none",60,2,585,99,190,5,291,0.16923076923076924,0.3247863247863248,8.5470085470085479E-3,0.49743589743589745]
["A",3,23,5.0999999999999996,30,60,2,585,99,0,5,482,0.16923076923076924,0,8.5470085470085479E-3,0.82393162393162389]
["A",3,23,5.0999999999999996,30,40,2,585,99,0,5,482,0.16923076923076924,0,8.5470085470085479E-3,0.82393162393162389]
["A",3,23,5.0999999999999996,30,20,2,585,99,0,5,482,0.16923076923076924,0,8.5470085470085479E-3,0.82393162393162389]

{"sheet":"B-3ft","index":6,"n_rows":50,"n_cols":16,"rows_kept":50,"cut":false,"hidden":true,"merged":[]}
[null,null,null,null,null,null,null,"Runoff","ET","Drainage","Overflow","Exfiltration"]
["Soil Type","Media Depth","Surf Storage","Area Ratio","Top of IWS","DC","Area Ratio","Rainfall","ET","Drainage","Runoff","VertSeepage","ET","Drainage","Overflow","Exfiltration"]
["B",3,30,28,"none",60,0.5,2734,100,1788,637,208,{"$f":"I3/H3","v":3.6576444769568395E-2},{"$f":"J3/H3","v":0.65398683247988298},{"$f":"K3/H3","v":0.23299195318215069},{"$f":"L3/H3","v":7.6079005120702273E-2}]
["B",3,30,28,30,60,0.5,2734,100,875,634,1124,3.6576444769568395E-2,0.3200438917337235,0.23189465983906365,0.41111923920994881]
["B",3,30,28,30,40,0.5,2734,100,746,695,1192,3.6576444769568395E-2,0.27286027798098023,0.25420629114850035,0.43599122165325532]
["B",3,30,28,30,20,0.5,2734,100,565,751,1317,3.6576444769568395E-2,0.20665691294806146,0.27468910021945869,0.48171177761521577]
["B",3,30,18.7,"none",60,0.75,1861,100,1358,226,177,5.3734551316496508E-2,0.7297152068780226,0.12144008597528211,9.5110155830198814E-2]
["B",3,30,18.7,30,60,0.75,1861,100,578,222,961,5.3734551316496508E-2,0.31058570660934981,0.11929070392262224,0.51638903815153148]
["B",3,30,18.7,30,40,0.75,1861,100,505,251,1006,5.3734551316496508E-2,0.27135948414830735,0.13487372380440624,0.5405695862439549]
["B",3,30,18.7,30,20,0.75,1861,100,387,278,1097,5.3734551316496508E-2,0.20795271359484149,0.14938205265986029,0.58946802794196673]
["B",3,30,14,"none",60,1,1420,100,1070,96,155,7.0422535211267609E-2,0.75352112676056338,6.7605633802816895E-2,0.10915492957746478]
["B",3,30,14,30,60,1,1420,100,391,93,836,7.0422535211267609E-2,0.27535211267605636,6.5492957746478869E-2,0.58873239436619718]
["B",3,30,14,30,40,1,1420,100,346,106,869,7.0422535211267609E-2,0.24366197183098592,7.464788732394366E-2,0.61197183098591545]
["B",3,30,14,30,20,1,1420,100,268,139,933,7.0422535211267609E-2,0.18873239436619718,9.7887323943661966E-2,0.65704225352112677]
["B",3,30,11.2,"none",60,1.25,1158,100,872,47,139,8.6355785837651119E-2,0.75302245250431776,4.0587219343696031E-2,0.12003454231433507]
["B",3,30,11.2,30,60,1.25,1158,100,271,46,741,8.6355785837651119E-2,0.23402417962003455,3.9723661485319514E-2,0.63989637305699487]
["B",3,30,11.2,30,40,1.25,1158,100,242,52,765,8.6355785837651119E-2,0.20898100172711573,4.4905008635578586E-2,0.6606217616580311]
["B",3,30,11.2,30,20,1.25,1158,100,187,60,811,8.6355785837651119E-2,0.1614853195164076,5.181347150259067E-2,0.70034542314335058]
["B",3,30,9.3000000000000007,"none",60,1.5,979,99,728,25,127,0.10112359550561797,0.74361593462717057,2.5536261491317672E-2,0.12972420837589377]
["B",3,30,9.3000000000000007,30,60,1.5,979,99,191,24,665,0.10112359550561797,0.19509703779366699,2.4514811031664963E-2,0.67926455566905009]
["B",3,30,9.3000000000000007,30,40,1.5,979,99,171,27,681,0.10112359550561797,0.17466802860061287,2.7579162410623085E-2,0.69560776302349336]
["B",3,30,9.3000000000000007,30,20,1.5,979,100,133,32,715,0.10214504596527069,0.13585291113381001,3.268641470888662E-2,0.7303370786516854]
["B",3,30,7,"none",60,2,764,99,545,9,110,0.12958115183246074,0.71335078534031415,1.1780104712041885E-2,0.14397905759162305]
["B",3,30,7,30,60,2,764,99,104,9,551,0.12958115183246074,0.13612565445026178,1.1780104712041885E-2,0.72120418848167545]
["B",3,30,7,30,40,2,764,99,93,11,560,0.12958115183246074,0.12172774869109948,1.4397905759162303E-2,0.73298429319371727]
["B",3,30,7,30,20,2,764,99,73,12,579,0.12958115183246074,9.5549738219895292E-2,1.5706806282722512E-2,0.75785340314136129]
["B",3,23,20.399999999999999,"none",60,0.5,2021,100,1374,368,179,4.9480455220188027E-2,0.67986145472538351,0.18208807521029194,8.8570014844136569E-2]
["B",3,23,20.399999999999999,30,60,0.5,2021,100,571,367,983,4.9480455220188027E-2,0.28253339930727361,0.18159327065809006,0.48639287481444832]
["B",3,23,20.399999999999999,30,40,0.5,2021,100,496,401,1024,4.9480455220188027E-2,0.24542305789213262,0.19841662543295399,0.50667986145472543]
["B",3,23,20.399999999999999,30,20,0.5,2021,100,372,439,1111,4.9480455220188027E-2,0.18406729341909944,0.21721919841662543,0.54972785749628894]
["B",3,23,13.6,"none",60,0.75,1383,100,1011,122,151,7.230657989877079E-2,0.73101952277657267,8.8214027476500367E-2,0.10918293564714389]
["B",3,23,13.6,30,60,0.75,1383,100,346,119,818,7.230657989877079E-2,0.25018076644974691,8.6044830079537241E-2,0.59146782357194505]
["B",3,23,13.6,30,40,0.75,1383,100,305,132,845,7.230657989877079E-2,0.22053506869125089,9.5444685466377438E-2,0.61099060014461315]
["B",3,23,13.6,30,20,0.75,1383,100,233,150,900,7.230657989877079E-2,0.16847433116413593,0.10845986984815618,0.65075921908893708]
["B",3,23,10.199999999999999,"none",60,1,1064,100,781,51,132,9.3984962406015032E-2,0.73402255639097747,4.7932330827067667E-2,0.12406015037593984]
["B",3,23,10.199999999999999,30,60,1,1064,100,215,50,700,9.3984962406015032E-2,0.20206766917293234,4.6992481203007516E-2,0.65789473684210531]
["B",3,23,10.199999999999999,30,40,1,1064,100,191,56,717,9.3984962406015032E-2,0.17951127819548873,5.2631578947368418E-2,0.67387218045112784]
["B",3,23,10.199999999999999,30,20,1,1064,100,147,63,754,9.3984962406015032E-2,0.13815789473684212,5.921052631578947E-2,0.70864661654135341]
["B",3,23,8.1999999999999993,"none",60,1.25,876,99,634,25,119,0.11301369863013698,0.72374429223744297,2.8538812785388126E-2,0.13584474885844749]
["B",3,23,8.1999999999999993,30,60,1.25,876,99,141,24,612,0.11301369863013698,0.16095890410958905,2.7397260273972601E-2,0.69863013698630139]
["B",3,23,8.1999999999999993,30,40,1.25,876,99,127,27,623,0.11301369863013698,0.1449771689497717,3.0821917808219176E-2,0.71118721461187218]
["B",3,23,8.1999999999999993,30,20,1.25,876,99,97,31,649,0.11301369863013698,0.11073059360730593,3.5388127853881277E-2,0.7408675799086758]
["B",3,23,6.8,"none",60,1.5,745,99,524,13,108,0.13288590604026845,0.70335570469798658,1.74496644295302E-2,0.14496644295302014]
["B",3,23,6.8,30,60,1.5,745,99,93,13,539,0.13288590604026845,0.12483221476510067,1.74496644295302E-2,0.72348993288590602]
["B",3,23,6.8,30,40,1.5,745,99,83,15,548,0.13288590604026845,0.11140939597315436,2.0134228187919462E-2,0.7355704697986577]
["B",3,23,6.8,30,20,1.5,745,99,65,17,564,0.13288590604026845,8.7248322147651006E-2,2.2818791946308724E-2,0.75704697986577185]
["B",3,23,5.0999999999999996,"none",60,2,585,99,389,5,93,0.16923076923076924,0.66495726495726493,8.5470085470085479E-3,0.15897435897435896]
["B",3,23,5.0999999999999996,30,60,2,585,99,47,5,435,0.16923076923076924,8.0341880341880348E-2,8.5470085470085479E-3,0.74358974358974361]
["B",3,23,5.0999999999999996,30,40,2,585,99,42,6,439,0.16923076923076924,7.179487179487179E-2,1.0256410256410256E-2,0.75042735042735043]
["B",3,23,5.0999999999999996,30,20,2,585,99,32,6,448,0.16923076923076924,5.4700854700854701E-2,1.0256410256410256E-2,0.76581196581196587]

{"sheet":"B-4ft","index":7,"n_rows":50,"n_cols":16,"rows_kept":50,"cut":false,"hidden":true,"merged":[]}
[null,null,null,null,null,null,null,"Runoff","ET","Drainage","Overflow","Exfiltration"]
["Soil Type","Media Depth","Surf Storage","Area Ratio","Top of IWS","DC","Area Ratio","Rainfall","ET","Drainage","Runoff","VertSeepage","ET","Drainage","Overflow","Exfiltration"]
["B",4,30,28,"none",60,0.5,2734,101,1778,619,237,{"$f":"I3/H3","v":3.6942209217264085E-2},{"$f":"J3/H3","v":0.65032918800292616},{"$f":"K3/H3","v":0.22640819312362839},{"$f":"L3/H3","v":8.6686174103877106E-2}]
["B",4,30,28,30,60,0.5,2734,101,652,624,1357,3.6942209217264085E-2,0.23847841989758595,0.2282370153621068,0.49634235552304318]
["B",4,30,28,30,40,0.5,2734,101,547,666,1420,3.6942209217264085E-2,0.20007315288953914,0.24359912216532553,0.51938551572787128]
["B",4,30,28,30,20,0.5,2734,101,412,697,1525,3.6942209217264085E-2,0.15069495245062181,0.25493782004389176,0.55779078273591809]
["B",4,30,18.7,"none",60,0.75,1861,101,1341,217,202,5.4271896829661471E-2,0.72058033315421821,0.11660397635679742,0.10854379365932294]
["B",4,30,18.7,30,60,0.75,1861,101,413,215,1133,5.4271896829661471E-2,0.22192369693713057,0.1155292853304675,0.60881246641590547]
["B",4,30,18.7,30,40,0.75,1861,101,353,235,1173,5.4271896829661471E-2,0.18968296614723268,0.12627619559376679,0.63030628694250401]
["B",4,30,18.7,30,20,0.75,1861,101,266,251,1244,5.4271896829661471E-2,0.1429339065018807,0.13487372380440624,0.66845781837721652]
["B",4,30,14,"none",60,1,1420,101,1050,91,179,7.1126760563380284E-2,0.73943661971830987,6.4084507042253519E-2,0.12605633802816901]
["B",4,30,14,30,60,1,1420,101,263,90,967,7.1126760563380284E-2,0.18521126760563381,6.3380281690140844E-2,0.68098591549295773]
["B",4,30,14,30,40,1,1420,101,225,99,995,7.1126760563380284E-2,0.15845070422535212,6.9718309859154934E-2,0.70070422535211263]
["B",4,30,14,30,20,1,1420,101,171,106,1043,7.1126760563380284E-2,0.12042253521126761,7.464788732394366E-2,0.73450704225352115]
["B",4,30,11.2,"none",60,1.25,1158,101,851,44,162,8.7219343696027629E-2,0.73488773747841107,3.7996545768566495E-2,0.13989637305699482]
["B",4,30,11.2,30,60,1.25,1158,100,169,44,845,8.6355785837651119E-2,0.1459412780656304,3.7996545768566495E-2,0.72970639032815199]
["B",4,30,11.2,30,40,1.25,1158,100,148,48,862,8.6355785837651119E-2,0.12780656303972365,4.145077720207254E-2,0.74438687392055269]
["B",4,30,11.2,30,20,1.25,1158,100,111,52,894,8.6355785837651119E-2,9.585492227979274E-2,4.4905008635578586E-2,0.772020725388601]
["B",4,30,9.3000000000000007,"none",60,1.5,979,101,706,23,149,0.10316649642492338,0.72114402451481108,2.3493360572012258E-2,0.15219611848825332]
["B",4,30,9.3000000000000007,30,60,1.5,979,100,113,24,743,0.10214504596527069,0.11542390194075587,2.4514811031664963E-2,0.75893769152196122]
["B",4,30,9.3000000000000007,30,40,1.5,979,100,99,25,755,0.10214504596527069,0.10112359550561797,2.5536261491317672E-2,0.77119509703779365]
["B",4,30,9.3000000000000007,30,20,1.5,979,100,75,27,777,0.10214504596527069,7.6608784473953015E-2,2.7579162410623085E-2,0.79366700715015326]
["B",4,30,7,"none",60,2,764,101,523,9,131,0.13219895287958114,0.68455497382198949,1.1780104712041885E-2,0.17146596858638743]
["B",4,30,7,30,60,2,764,100,55,9,599,0.13089005235602094,7.1989528795811525E-2,1.1780104712041885E-2,0.78403141361256545]
["B",4,30,7,30,40,2,764,100,48,10,606,0.13089005235602094,6.2827225130890049E-2,1.3089005235602094E-2,0.79319371727748689]
["B",4,30,7,30,20,2,764,100,36,10,617,0.13089005235602094,4.712041884816754E-2,1.3089005235602094E-2,0.80759162303664922]
["B",4,23,20.399999999999999,"none",60,0.5,2021,101,1361,354,205,4.9975259772389903E-2,0.67342899554675906,0.17516081147946561,0.10143493320138545]
["B",4,23,20.399999999999999,30,60,0.5,2021,101,401,353,1166,4.9975259772389903E-2,0.19841662543295399,0.17466600692726372,0.57694210786739242]
["B",4,23,20.399999999999999,30,40,0.5,2021,101,338,379,1203,4.9975259772389903E-2,0.16724393864423553,0.18753092528451262,0.59524987629886195]
["B",4,23,20.399999999999999,30,20,0.5,2021,101,252,400,1268,4.9975259772389903E-2,0.12469074715487383,0.19792182088075211,0.6274121721919842]
["B",4,23,13.6,"none",60,0.75,1383,101,992,116,175,7.3029645697758494E-2,0.71728127259580621,8.3875632682574114E-2,0.12653651482284889]
["B",4,23,13.6,30,60,0.75,1383,101,222,115,945,7.3029645697758494E-2,0.16052060737527116,8.315256688358641E-2,0.68329718004338391]
["B",4,23,13.6,30,40,0.75,1383,101,191,124,967,7.3029645697758494E-2,0.13810556760665221,8.9660159074475776E-2,0.69920462762111357]
["B",4,23,13.6,30,20,0.75,1383,101,142,133,1007,7.3029645697758494E-2,0.10267534345625452,9.6167751265365142E-2,0.72812725958062186]
["B",4,23,10.199999999999999,"none",60,1,1064,101,761,48,155,9.492481203007519E-2,0.71522556390977443,4.5112781954887216E-2,0.14567669172932332]
["B",4,23,10.199999999999999,30,60,1,1064,100,126,48,790,9.3984962406015032E-2,0.11842105263157894,4.5112781954887216E-2,0.74248120300751874]
["B",4,23,10.199999999999999,30,40,1,1064,100,110,51,803,9.3984962406015032E-2,0.10338345864661654,4.7932330827067667E-2,0.75469924812030076]
["B",4,23,10.199999999999999,30,20,1,1064,100,83,55,826,9.3984962406015032E-2,7.8007518796992484E-2,5.1691729323308268E-2,0.77631578947368418]
["B",4,23,8.1999999999999993,"none",60,1.25,876,101,612,23,141,0.11529680365296803,0.69863013698630139,2.6255707762557076E-2,0.16095890410958905]
["B",4,23,8.1999999999999993,30,60,1.25,876,100,76,24,676,0.11415525114155251,8.6757990867579904E-2,2.7397260273972601E-2,0.77168949771689499]
["B",4,23,8.1999999999999993,30,40,1.25,876,100,67,24,684,0.11415525114155251,7.6484018264840178E-2,2.7397260273972601E-2,0.78082191780821919]
["B",4,23,8.1999999999999993,30,20,1.25,876,100,51,26,699,0.11415525114155251,5.8219178082191778E-2,2.9680365296803651E-2,0.79794520547945202]
["B",4,23,6.8,"none",60,1.5,745,101,503,13,129,0.13557046979865772,0.67516778523489929,1.74496644295302E-2,0.17315436241610738]
["B",4,23,6.8,30,60,1.5,745,100,48,13,584,0.13422818791946309,6.4429530201342289E-2,1.74496644295302E-2,0.78389261744966443]
["B",4,23,6.8,30,40,1.5,745,100,41,14,590,0.13422818791946309,5.5033557046979868E-2,1.8791946308724831E-2,0.79194630872483218]
["B",4,23,6.8,30,20,1.5,745,100,31,14,599,0.13422818791946309,4.1610738255033558E-2,1.8791946308724831E-2,0.80402684563758386]
["B",4,23,5.0999999999999996,"none",60,2,585,100,369,4,111,0.17094017094017094,0.63076923076923075,6.8376068376068376E-3,0.18974358974358974]
["B",4,23,5.0999999999999996,30,60,2,585,100,21,4,460,0.17094017094017094,3.5897435897435895E-2,6.8376068376068376E-3,0.78632478632478631]
["B",4,23,5.0999999999999996,30,40,2,585,100,19,5,462,0.17094017094017094,3.2478632478632481E-2,8.5470085470085479E-3,0.78974358974358971]
["B",4,23,5.0999999999999996,30,20,2,585,100,14,5,466,0.17094017094017094,2.3931623931623933E-2,8.5470085470085479E-3,0.79658119658119653]

{"sheet":"C-3ft","index":8,"n_rows":50,"n_cols":16,"rows_kept":50,"cut":false,"hidden":true,"merged":[]}
[null,null,null,null,null,null,null,"Runoff","ET","Drainage","Overflow","Exfiltration"]
["Soil Type","Media Depth","Surf Storage","Area Ratio","Top of IWS","DC","Area Ratio","Rainfall","ET","Drainage","Runoff","VertSeepage","ET","Drainage","Overflow","Exfiltration"]
["C",3,30,28,"none",60,0.5,2734,100,1952,638,44,{"$f":"I3/H3","v":3.6576444769568395E-2},{"$f":"J3/H3","v":0.71397220190197508},{"$f":"K3/H3","v":0.23335771762984639},{"$f":"L3/H3","v":1.6093635698610095E-2}]
["C",3,30,28,45,60,0.5,2734,100,1594,680,359,3.6576444769568395E-2,0.58302852962692031,0.24871982443306512,0.13130943672275056]
["C",3,30,28,45,40,0.5,2734,100,1480,776,378,3.6576444769568395E-2,0.54133138258961233,0.28383321141185075,0.13825896122896855]
["C",3,30,28,45,20,0.5,2734,100,1269,948,416,3.6576444769568395E-2,0.46415508412582296,0.34674469641550842,0.15215801024140455]
["C",3,30,18.7,"none",60,0.75,1861,100,1497,227,38,5.3734551316496508E-2,0.80440623320795268,0.12197743148844707,2.0419129500268671E-2]
["C",3,30,18.7,45,60,0.75,1861,100,1177,244,341,5.3734551316496508E-2,0.63245566899516392,0.13111230521225148,0.18323481998925309]
["C",3,30,18.7,45,40,0.75,1861,100,1115,290,355,5.3734551316496508E-2,0.5991402471789361,0.15583019881783988,0.19075765717356261]
["C",3,30,18.7,45,20,0.75,1861,100,990,384,387,5.3734551316496508E-2,0.53197205803331538,0.20634067705534659,0.20795271359484149]
["C",3,30,14,"none",60,1,1420,100,1191,96,34,7.0422535211267609E-2,0.83873239436619718,6.7605633802816895E-2,2.3943661971830985E-2]
["C",3,30,14,45,60,1,1420,100,890,104,326,7.0422535211267609E-2,0.62676056338028174,7.3239436619718309E-2,0.22957746478873239]
["C",3,30,14,45,40,1,1420,100,856,127,337,7.0422535211267609E-2,0.60281690140845068,8.9436619718309865E-2,0.23732394366197182]
["C",3,30,14,45,20,1,1420,100,778,178,363,7.0422535211267609E-2,0.54788732394366202,0.12535211267605634,0.2556338028169014]
["C",3,30,11.2,"none",60,1.25,1158,100,980,47,31,8.6355785837651119E-2,0.84628670120898097,4.0587219343696031E-2,2.6770293609671848E-2]
["C",3,30,11.2,45,60,1.25,1158,100,695,51,312,8.6355785837651119E-2,0.60017271157167529,4.4041450777202069E-2,0.26943005181347152]
["C",3,30,11.2,45,40,1.25,1158,100,673,63,322,8.6355785837651119E-2,0.58117443868739205,5.4404145077720206E-2,0.27806563039723664]
["C",3,30,11.2,45,20,1.25,1158,100,623,91,343,8.6355785837651119E-2,0.53799654576856648,7.8583765112262519E-2,0.29620034542314333]
["C",3,30,9.3000000000000007,"none",60,1.5,979,100,827,25,28,0.10214504596527069,0.84473953013278857,2.5536261491317672E-2,2.8600612870275793E-2]
["C",3,30,9.3000000000000007,45,60,1.5,979,100,552,27,300,0.10214504596527069,0.56384065372829417,2.7579162410623085E-2,0.30643513789581206]
["C",3,30,9.3000000000000007,45,40,1.5,979,100,538,34,308,0.10214504596527069,0.54954034729315626,3.472931562819203E-2,0.3146067415730337]
["C",3,30,9.3000000000000007,45,20,1.5,979,100,503,51,325,0.10214504596527069,0.5137895812053116,5.2093973442288048E-2,0.33197139938712972]
["C",3,30,7,"none",60,2,764,99,630,9,25,0.12958115183246074,0.82460732984293195,1.1780104712041885E-2,3.2722513089005235E-2]
["C",3,30,7,45,60,2,764,100,374,10,280,0.13089005235602094,0.48952879581151831,1.3089005235602094E-2,0.36649214659685864]
["C",3,30,7,45,40,2,764,100,365,14,285,0.13089005235602094,0.47774869109947643,1.832460732984293E-2,0.37303664921465968]
["C",3,30,7,45,20,2,764,100,347,19,298,0.13089005235602094,0.45418848167539266,2.4869109947643978E-2,0.3900523560209424]
["C",3,23,20.399999999999999,"none",60,0.5,2021,100,1514,369,38,4.9480455220188027E-2,0.74913409203364667,0.18258287976249382,1.880257298367145E-2]
["C",3,23,20.399999999999999,45,60,0.5,2021,100,1181,396,344,4.9480455220188027E-2,0.58436417615042058,0.19594260267194458,0.1702127659574468]
["C",3,23,20.399999999999999,45,40,0.5,2021,100,1098,465,357,4.9480455220188027E-2,0.54329539831766449,0.23008411677387433,0.17664522513607125]
["C",3,23,20.399999999999999,45,20,0.5,2021,100,951,583,386,4.9480455220188027E-2,0.47055912914398812,0.28847105393369621,0.19099455714992578]
["C",3,23,13.6,"none",60,0.75,1383,100,1128,122,33,7.230657989877079E-2,0.81561822125813443,8.8214027476500367E-2,2.3861171366594359E-2]
["C",3,23,13.6,45,60,0.75,1383,100,828,132,323,7.230657989877079E-2,0.59869848156182215,9.5444685466377438E-2,0.23355025307302965]
["C",3,23,13.6,45,40,0.75,1383,100,788,161,334,7.230657989877079E-2,0.56977584960231376,0.11641359363702097,0.24150397686189443]
["C",3,23,13.6,45,20,0.75,1383,100,706,220,356,7.230657989877079E-2,0.51048445408532173,0.15907447577729572,0.257411424439624]
["C",3,23,10.199999999999999,"none",60,1,1064,100,884,51,29,9.3984962406015032E-2,0.83082706766917291,4.7932330827067667E-2,2.7255639097744359E-2]
["C",3,23,10.199999999999999,45,60,1,1064,100,603,55,306,9.3984962406015032E-2,0.56672932330827064,5.1691729323308268E-2,0.28759398496240601]
["C",3,23,10.199999999999999,45,40,1,1064,100,581,69,314,9.3984962406015032E-2,0.54605263157894735,6.4849624060150379E-2,0.29511278195488722]
["C",3,23,10.199999999999999,45,20,1,1064,100,535,97,332,9.3984962406015032E-2,0.5028195488721805,9.1165413533834588E-2,0.31203007518796994]
["C",3,23,8.1999999999999993,"none",60,1.25,876,99,726,25,27,0.11301369863013698,0.82876712328767121,2.8538812785388126E-2,3.0821917808219176E-2]
["C",3,23,8.1999999999999993,45,60,1.25,876,100,458,27,291,0.11415525114155251,0.52283105022831056,3.0821917808219176E-2,0.3321917808219178]
["C",3,23,8.1999999999999993,45,40,1.25,876,100,444,34,298,0.11415525114155251,0.50684931506849318,3.8812785388127852E-2,0.34018264840182649]
["C",3,23,8.1999999999999993,45,20,1.25,876,100,415,49,312,0.11415525114155251,0.47374429223744291,5.5936073059360727E-2,0.35616438356164382]
["C",3,23,6.8,"none",60,1.5,745,99,608,13,24,0.13288590604026845,0.81610738255033555,1.74496644295302E-2,3.2214765100671144E-2]
["C",3,23,6.8,45,60,1.5,745,99,353,14,277,0.13288590604026845,0.47382550335570472,1.8791946308724831E-2,0.37181208053691273]
["C",3,23,6.8,45,40,1.5,745,100,344,19,283,0.13422818791946309,0.46174496644295304,2.5503355704697986E-2,0.37986577181208053]
["C",3,23,6.8,45,20,1.5,745,100,324,27,294,0.13422818791946309,0.43489932885906041,3.6241610738255034E-2,0.39463087248322148]
["C",3,23,5.0999999999999996,"none",60,2,585,99,461,5,21,0.16923076923076924,0.78803418803418801,8.5470085470085479E-3,3.5897435897435895E-2]
["C",3,23,5.0999999999999996,45,60,2,585,99,227,5,254,0.16923076923076924,0.38803418803418804,8.5470085470085479E-3,0.4341880341880342]
["C",3,23,5.0999999999999996,45,40,2,585,99,221,7,258,0.16923076923076924,0.37777777777777777,1.1965811965811967E-2,0.44102564102564101]
["C",3,23,5.0999999999999996,45,20,2,585,99,210,11,265,0.16923076923076924,0.35897435897435898,1.8803418803418803E-2,0.45299145299145299]

{"sheet":"C-4ft","index":9,"n_rows":50,"n_cols":16,"rows_kept":50,"cut":false,"hidden":true,"merged":[]}
[null,null,null,null,null,null,null,"Runoff","ET","Drainage","Overflow","Exfiltration"]
["Soil Type","Media Depth","Surf Storage","Area Ratio","Top of IWS","DC","Area Ratio","Rainfall","ET","Drainage","Runoff","VertSeepage","ET","Drainage","Overflow","Exfiltration"]
["C",4,30,28,"none",60,0.5,2734,101,1958,620,55,{"$f":"I3/H3","v":3.6942209217264085E-2},{"$f":"J3/H3","v":0.71616678858814919},{"$f":"K3/H3","v":0.22677395757132407},{"$f":"L3/H3","v":2.0117044623262619E-2}]
["C",4,30,28,45,60,0.5,2734,101,1477,663,493,3.6942209217264085E-2,0.54023408924652527,0.24250182882223847,0.18032187271397221]
["C",4,30,28,45,40,0.5,2734,101,1345,773,515,3.6942209217264085E-2,0.49195318215069495,0.28273591806876369,0.18836869056327724]
["C",4,30,28,45,20,0.5,2734,101,1167,911,555,3.6942209217264085E-2,0.42684711046086321,0.33321141185076808,0.20299926847110461]
["C",4,30,18.7,"none",60,0.75,1861,101,1494,218,49,5.4271896829661471E-2,0.80279419666845786,0.11714132186996239,2.6329930145083287E-2]
["C",4,30,18.7,45,60,0.75,1861,101,1059,236,466,5.4271896829661471E-2,0.56904889844169804,0.12681354110693177,0.25040300913487373]
["C",4,30,18.7,45,40,0.75,1861,101,990,287,483,5.4271896829661471E-2,0.53197205803331538,0.15421816227834498,0.25953788285867813]
["C",4,30,18.7,45,20,0.75,1861,101,883,362,515,5.4271896829661471E-2,0.47447608812466419,0.19451907576571736,0.27673293927995701]
["C",4,30,14,"none",60,1,1420,101,1184,91,45,7.1126760563380284E-2,0.83380281690140845,6.4084507042253519E-2,3.1690140845070422E-2]
["C",4,30,14,45,60,1,1420,101,779,99,442,7.1126760563380284E-2,0.54859154929577469,6.9718309859154934E-2,0.31126760563380279]
["C",4,30,14,45,40,1,1420,101,739,125,455,7.1126760563380284E-2,0.52042253521126758,8.8028169014084501E-2,0.32042253521126762]
["C",4,30,14,45,20,1,1420,101,674,164,481,7.1126760563380284E-2,0.47464788732394364,0.11549295774647887,0.33873239436619718]
["C",4,30,11.2,"none",60,1.25,1158,101,971,44,42,8.7219343696027629E-2,0.83851468048359246,3.7996545768566495E-2,3.6269430051813469E-2]
["C",4,30,11.2,45,60,1.25,1158,101,588,48,420,8.7219343696027629E-2,0.50777202072538863,4.145077720207254E-2,0.36269430051813473]
["C",4,30,11.2,45,40,1.25,1158,101,563,62,431,8.7219343696027629E-2,0.48618307426597585,5.3540587219343697E-2,0.37219343696027635]
["C",4,30,11.2,45,20,1.25,1158,101,521,83,452,8.7219343696027629E-2,0.44991364421416236,7.1675302245250427E-2,0.39032815198618309]
["C",4,30,9.3000000000000007,"none",60,1.5,979,101,816,24,39,0.10316649642492338,0.83350357507660877,2.4514811031664963E-2,3.9836567926455568E-2]
["C",4,30,9.3000000000000007,45,60,1.5,979,101,452,26,401,0.10316649642492338,0.46169560776302349,2.6557711950970377E-2,0.40960163432073543]
["C",4,30,9.3000000000000007,45,40,1.5,979,101,436,33,409,0.10316649642492338,0.44535240040858021,3.3707865168539325E-2,0.41777323799795713]
["C",4,30,9.3000000000000007,45,20,1.5,979,101,407,45,426,0.10316649642492338,0.4157303370786517,4.5965270684371805E-2,0.43513789581205309]
["C",4,30,7,"none",60,2,764,101,619,9,36,0.13219895287958114,0.81020942408376961,1.1780104712041885E-2,4.712041884816754E-2]
["C",4,30,7,45,60,2,764,101,286,10,367,0.13219895287958114,0.37434554973821987,1.3089005235602094E-2,0.48036649214659688]
["C",4,30,7,45,40,2,764,101,277,13,372,0.13219895287958114,0.36256544502617799,1.7015706806282723E-2,0.48691099476439792]
["C",4,30,7,45,20,2,764,101,262,17,384,0.13219895287958114,0.34293193717277487,2.2251308900523559E-2,0.50261780104712039]
["C",4,23,20.399999999999999,"none",60,0.5,2021,101,1516,355,49,4.9975259772389903E-2,0.75012370113805049,0.17565561603166749,2.4245423057892134E-2]
["C",4,23,20.399999999999999,45,60,0.5,2021,101,1064,385,470,4.9975259772389903E-2,0.52647204354280064,0.19049975259772389,0.23255813953488372]
["C",4,23,20.399999999999999,45,40,0.5,2021,101,979,454,487,4.9975259772389903E-2,0.48441365660564079,0.22464126669965365,0.24096981692231567]
["C",4,23,20.399999999999999,45,20,0.5,2021,101,851,552,516,4.9975259772389903E-2,0.42107867392380011,0.27313211281543792,0.25531914893617019]
["C",4,23,13.6,"none",60,0.75,1383,101,1123,116,44,7.3029645697758494E-2,0.812002892263196,8.3875632682574114E-2,3.1814895155459148E-2]
["C",4,23,13.6,45,60,0.75,1383,101,717,126,438,7.3029645697758494E-2,0.51843817787418656,9.1106290672451198E-2,0.31670281995661603]
["C",4,23,13.6,45,40,0.75,1383,101,676,156,450,7.3029645697758494E-2,0.48879248011569054,0.11279826464208242,0.32537960954446854]
["C",4,23,13.6,45,20,0.75,1383,101,606,202,473,7.3029645697758494E-2,0.43817787418655096,0.14605929139551699,0.34201012292118582]
["C",4,23,10.199999999999999,"none",60,1,1064,101,875,48,40,9.492481203007519E-2,0.82236842105263153,4.5112781954887216E-2,3.7593984962406013E-2]
["C",4,23,10.199999999999999,45,60,1,1064,101,500,53,410,9.492481203007519E-2,0.46992481203007519,4.9812030075187967E-2,0.38533834586466165]
["C",4,23,10.199999999999999,45,40,1,1064,101,478,66,419,9.492481203007519E-2,0.4492481203007519,6.2030075187969921E-2,0.39379699248120303]
["C",4,23,10.199999999999999,45,20,1,1064,101,439,87,437,9.492481203007519E-2,0.41259398496240601,8.1766917293233085E-2,0.4107142857142857]
["C",4,23,8.1999999999999993,"none",60,1.25,876,101,715,23,37,0.11529680365296803,0.81621004566210043,2.6255707762557076E-2,4.2237442922374427E-2]
["C",4,23,8.1999999999999993,45,60,1.25,876,101,364,25,386,0.11529680365296803,0.41552511415525112,2.8538812785388126E-2,0.4406392694063927]
["C",4,23,8.1999999999999993,45,40,1.25,876,101,350,33,393,0.11529680365296803,0.3995433789954338,3.7671232876712327E-2,0.44863013698630139]
["C",4,23,8.1999999999999993,45,20,1.25,876,101,326,43,406,0.11529680365296803,0.37214611872146119,4.9086757990867577E-2,0.4634703196347032]
["C",4,23,6.8,"none",60,1.5,745,101,597,13,35,0.13557046979865772,0.80134228187919465,1.74496644295302E-2,4.6979865771812082E-2]
["C",4,23,6.8,45,60,1.5,745,101,267,14,363,0.13557046979865772,0.35838926174496644,1.8791946308724831E-2,0.48724832214765101]
["C",4,23,6.8,45,40,1.5,745,101,258,17,368,0.13557046979865772,0.34630872483221475,2.2818791946308724E-2,0.49395973154362416]
["C",4,23,6.8,45,20,1.5,745,101,242,23,378,0.13557046979865772,0.32483221476510066,3.087248322147651E-2,0.50738255033557045]
["C",4,23,5.0999999999999996,"none",60,2,585,101,449,4,32,0.17264957264957265,0.76752136752136757,6.8376068376068376E-3,5.4700854700854701E-2]
["C",4,23,5.0999999999999996,45,60,2,585,101,155,5,324,0.17264957264957265,0.26495726495726496,8.5470085470085479E-3,0.55384615384615388]
["C",4,23,5.0999999999999996,45,40,2,585,101,150,7,328,0.17264957264957265,0.25641025641025639,1.1965811965811967E-2,0.56068376068376069]
["C",4,23,5.0999999999999996,45,20,2,585,101,141,9,334,0.17264957264957265,0.24102564102564103,1.5384615384615385E-2,0.57094017094017091]

{"sheet":"D-3ft","index":10,"n_rows":50,"n_cols":16,"rows_kept":50,"cut":false,"hidden":true,"merged":[]}
[null,null,null,null,null,null,null,"Runoff","ET","Drainage","Overflow","Exfiltration"]
["Soil Type","Media Depth","Surf Storage","Area Ratio","Top of IWS","DC","Area Ratio","Rainfall","ET","Drainage","Runoff","VertSeepage","ET","Drainage","Overflow","Exfiltration"]
["D",3,30,28,"none",60,0.5,2734,100,1991,639,5,{"$f":"I3/H3","v":3.6576444769568395E-2},{"$f":"J3/H3","v":0.72823701536210683},{"$f":"K3/H3","v":0.23372348207754207},{"$f":"L3/H3","v":1.8288222384784199E-3}]
["D",3,30,28,45,60,0.5,2734,101,1865,716,51,3.6942209217264085E-2,0.68215069495245062,0.2618873445501097,1.8653986832479885E-2]
["D",3,30,28,45,40,0.5,2734,101,1754,826,53,3.6942209217264085E-2,0.6415508412582297,0.30212143379663497,1.9385515727871252E-2]
["D",3,30,28,45,20,0.5,2734,101,1546,1031,56,3.6942209217264085E-2,0.56547183613752738,0.37710314557425018,2.0482809070958303E-2]
["D",3,30,18.7,"none",60,0.75,1861,100,1531,227,4,5.3734551316496508E-2,0.82267598065556158,0.12197743148844707,2.1493820526598604E-3]
["D",3,30,18.7,45,60,0.75,1861,101,1450,260,50,5.4271896829661471E-2,0.7791509940891993,0.13970983342289092,2.6867275658248254E-2]
["D",3,30,18.7,45,40,0.75,1861,101,1388,321,52,5.4271896829661471E-2,0.74583557227297148,0.17248790972595379,2.7941966684578184E-2]
["D",3,30,18.7,45,20,0.75,1861,101,1270,436,54,5.4271896829661471E-2,0.6824288017195056,0.23428264373992477,2.9016657710908115E-2]
["D",3,30,14,"none",60,1,1420,100,1221,96,4,7.0422535211267609E-2,0.85985915492957743,6.7605633802816895E-2,2.8169014084507044E-3]
["D",3,30,14,45,60,1,1420,101,1157,113,50,7.1126760563380284E-2,0.81478873239436622,7.9577464788732399E-2,3.5211267605633804E-2]
["D",3,30,14,45,40,1,1420,101,1126,143,51,7.1126760563380284E-2,0.79295774647887329,0.10070422535211268,3.591549295774648E-2]
["D",3,30,14,45,20,1,1420,101,1058,208,53,7.1126760563380284E-2,0.74507042253521127,0.14647887323943662,3.732394366197183E-2]
["D",3,30,11.2,"none",60,1.25,1158,100,1008,47,3,8.6355785837651119E-2,0.8704663212435233,4.0587219343696031E-2,2.5906735751295338E-3]
["D",3,30,11.2,45,60,1.25,1158,101,952,56,49,8.7219343696027629E-2,0.82210708117443865,4.8359240069084632E-2,4.231433506044905E-2]
["D",3,30,11.2,45,40,1.25,1158,101,934,72,50,8.7219343696027629E-2,0.8065630397236615,6.2176165803108807E-2,4.317789291882556E-2]
["D",3,30,11.2,45,20,1.25,1158,101,893,111,52,8.7219343696027629E-2,0.77115716753022456,9.585492227979274E-2,4.4905008635578586E-2]
["D",3,30,9.3000000000000007,"none",60,1.5,979,99,852,25,3,0.10112359550561797,0.87027579162410618,2.5536261491317672E-2,3.0643513789581204E-3]
["D",3,30,9.3000000000000007,45,60,1.5,979,101,800,30,48,0.10316649642492338,0.81716036772216549,3.0643513789581207E-2,4.9029622063329927E-2]
["D",3,30,9.3000000000000007,45,40,1.5,979,101,789,40,49,0.10316649642492338,0.80592441266598569,4.0858018386108273E-2,5.0051072522982638E-2]
["D",3,30,9.3000000000000007,45,20,1.5,979,101,764,63,51,0.10316649642492338,0.78038815117466798,6.4351378958120528E-2,5.2093973442288048E-2]
["D",3,30,7,"none",60,2,764,99,653,9,2,0.12958115183246074,0.85471204188481675,1.1780104712041885E-2,2.617801047120419E-3]
["D",3,30,7,45,60,2,764,101,603,12,48,0.13219895287958114,0.78926701570680624,1.5706806282722512E-2,6.2827225130890049E-2]
["D",3,30,7,45,40,2,764,101,599,16,48,0.13219895287958114,0.78403141361256545,2.0942408376963352E-2,6.2827225130890049E-2]
["D",3,30,7,45,20,2,764,101,587,25,50,0.13219895287958114,0.76832460732984298,3.2722513089005235E-2,6.5445026178010471E-2]
["D",3,23,20.399999999999999,"none",60,0.5,2021,100,1548,369,4,4.9480455220188027E-2,0.76595744680851063,0.18258287976249382,1.9792182088075212E-3]
["D",3,23,20.399999999999999,45,60,0.5,2021,101,1451,418,50,4.9975259772389903E-2,0.71796140524492824,0.20682830282038595,2.4740227610094014E-2]
["D",3,23,20.399999999999999,45,40,0.5,2021,101,1362,506,52,4.9975259772389903E-2,0.67392380009896091,0.25037110341415142,2.5729836714497772E-2]
["D",3,23,20.399999999999999,45,20,0.5,2021,101,1214,651,54,4.9975259772389903E-2,0.60069272637308269,0.32211776348342402,2.6719445818901535E-2]
["D",3,23,13.6,"none",60,0.75,1383,100,1158,122,3,7.230657989877079E-2,0.83731019522776573,8.8214027476500367E-2,2.1691973969631237E-3]
["D",3,23,13.6,45,60,0.75,1383,101,1090,142,49,7.3029645697758494E-2,0.78814172089660162,0.10267534345625452,3.5430224150397684E-2]
["D",3,23,13.6,45,40,0.75,1383,101,1048,183,50,7.3029645697758494E-2,0.75777295733911787,0.13232104121475055,3.6153289949385395E-2]
["D",3,23,13.6,45,20,0.75,1383,101,970,259,53,7.3029645697758494E-2,0.70137382501807666,0.18727404193781635,3.8322487346348515E-2]
["D",3,23,10.199999999999999,"none",60,1,1064,100,910,51,3,9.3984962406015032E-2,0.85526315789473684,4.7932330827067667E-2,2.819548872180451E-3]
["D",3,23,10.199999999999999,45,60,1,1064,101,854,60,49,9.492481203007519E-2,0.80263157894736847,5.6390977443609019E-2,4.6052631578947366E-2]
["D",3,23,10.199999999999999,45,40,1,1064,101,833,80,50,9.492481203007519E-2,0.78289473684210531,7.5187969924812026E-2,4.6992481203007516E-2]
["D",3,23,10.199999999999999,45,20,1,1064,101,791,120,51,9.492481203007519E-2,0.74342105263157898,0.11278195488721804,4.7932330827067667E-2]
["D",3,23,8.1999999999999993,"none",60,1.25,876,99,750,25,3,0.11301369863013698,0.85616438356164382,2.8538812785388126E-2,3.4246575342465752E-3]
["D",3,23,8.1999999999999993,45,60,1.25,876,101,697,30,48,0.11529680365296803,0.795662100456621,3.4246575342465752E-2,5.4794520547945202E-2]
["D",3,23,8.1999999999999993,45,40,1.25,876,101,685,41,49,0.11529680365296803,0.78196347031963476,4.6803652968036527E-2,5.5936073059360727E-2]
["D",3,23,8.1999999999999993,45,20,1.25,876,101,661,64,50,0.11529680365296803,0.75456621004566216,7.3059360730593603E-2,5.7077625570776253E-2]
["D",3,23,6.8,"none",60,1.5,745,99,630,13,2,0.13288590604026845,0.84563758389261745,1.74496644295302E-2,2.6845637583892616E-3]
["D",3,23,6.8,45,60,1.5,745,101,580,16,48,0.13557046979865772,0.77852348993288589,2.1476510067114093E-2,6.4429530201342289E-2]
["D",3,23,6.8,45,40,1.5,745,101,574,22,48,0.13557046979865772,0.77046979865771814,2.9530201342281879E-2,6.4429530201342289E-2]
["D",3,23,6.8,45,20,1.5,745,101,558,36,50,0.13557046979865772,0.74899328859060399,4.832214765100671E-2,6.7114093959731544E-2]
["D",3,23,5.0999999999999996,"none",60,2,585,99,480,5,2,0.16923076923076924,0.82051282051282048,8.5470085470085479E-3,3.4188034188034188E-3]
["D",3,23,5.0999999999999996,45,60,2,585,101,432,6,47,0.17264957264957265,0.7384615384615385,1.0256410256410256E-2,8.0341880341880348E-2]
["D",3,23,5.0999999999999996,45,40,2,585,101,428,9,47,0.17264957264957265,0.73162393162393158,1.5384615384615385E-2,8.0341880341880348E-2]
["D",3,23,5.0999999999999996,45,20,2,585,101,422,14,48,0.17264957264957265,0.72136752136752136,2.3931623931623933E-2,8.2051282051282051E-2]

{"sheet":"D-4ft","index":11,"n_rows":50,"n_cols":16,"rows_kept":50,"cut":false,"hidden":true,"merged":[]}
[null,null,null,null,null,null,null,"Runoff","ET","Drainage","Overflow","Exfiltration"]
["Soil Type","Media Depth","Surf Storage","Area Ratio","Top of IWS","DC","Area Ratio","Rainfall","ET","Drainage","Runoff","VertSeepage","ET","Drainage","Overflow","Exfiltration"]
["D",4,30,28,"none",60,0.5,2734,101,2007,620,6,{"$f":"I3/H3","v":3.6942209217264085E-2},{"$f":"J3/H3","v":0.73408924652523777},{"$f":"K3/H3","v":0.22677395757132407},{"$f":"L3/H3","v":2.1945866861741038E-3}]
["D",4,30,28,45,60,0.5,2734,101,1856,705,72,3.6942209217264085E-2,0.67885881492318945,0.25786393562545723,2.6335040234089245E-2]
["D",4,30,28,45,40,0.5,2734,101,1732,827,74,3.6942209217264085E-2,0.63350402340892464,0.30248719824433062,2.7066569129480616E-2]
["D",4,30,28,45,20,0.5,2734,101,1531,1025,77,3.6942209217264085E-2,0.55998536942209221,0.37490855888807606,2.8163862472567667E-2]
["D",4,30,18.7,"none",60,0.75,1861,101,1537,218,6,5.4271896829661471E-2,0.82590005373455133,0.11714132186996239,3.2240730789897904E-3]
["D",4,30,18.7,45,60,0.75,1861,101,1433,256,71,5.4271896829661471E-2,0.77001612036539491,0.13756045137023107,3.8151531434712518E-2]
["D",4,30,18.7,45,40,0.75,1861,101,1367,321,72,5.4271896829661471E-2,0.73455131649650729,0.17248790972595379,3.8688876947877482E-2]
["D",4,30,18.7,45,20,0.75,1861,101,1253,432,75,5.4271896829661471E-2,0.6732939279957012,0.23213326168726492,4.0300913487372379E-2]
["D",4,30,14,"none",60,1,1420,101,1223,91,5,7.1126760563380284E-2,0.86126760563380278,6.4084507042253519E-2,3.5211267605633804E-3]
["D",4,30,14,45,60,1,1420,101,1140,109,70,7.1126760563380284E-2,0.80281690140845074,7.6760563380281685E-2,4.9295774647887321E-2]
["D",4,30,14,45,40,1,1420,101,1106,142,71,7.1126760563380284E-2,0.77887323943661968,0.1,0.05]
["D",4,30,14,45,20,1,1420,101,1039,206,74,7.1126760563380284E-2,0.73169014084507045,0.14507042253521127,5.2112676056338028E-2]
["D",4,30,11.2,"none",60,1.25,1158,101,1008,44,5,8.7219343696027629E-2,0.8704663212435233,3.7996545768566495E-2,4.3177892918825561E-3]
["D",4,30,11.2,45,60,1.25,1158,101,934,52,69,8.7219343696027629E-2,0.8065630397236615,4.4905008635578586E-2,5.9585492227979271E-2]
["D",4,30,11.2,45,40,1.25,1158,101,914,72,70,8.7219343696027629E-2,0.78929188255613125,6.2176165803108807E-2,6.0449050086355788E-2]
["D",4,30,11.2,45,20,1.25,1158,101,875,109,73,8.7219343696027629E-2,0.75561312607944731,9.412780656303972E-2,6.3039723661485317E-2]
["D",4,30,9.3000000000000007,"none",60,1.5,979,101,851,24,5,0.10316649642492338,0.86925434116445355,2.4514811031664963E-2,5.1072522982635342E-3]
["D",4,30,9.3000000000000007,45,60,1.5,979,101,780,29,69,0.10316649642492338,0.79673135852911137,2.9622063329928498E-2,7.0480081716036772E-2]
["D",4,30,9.3000000000000007,45,40,1.5,979,101,769,40,70,0.10316649642492338,0.78549540347293156,4.0858018386108273E-2,7.1501532175689483E-2]
["D",4,30,9.3000000000000007,45,20,1.5,979,101,745,62,72,0.10316649642492338,0.76098059244126659,6.332992849846783E-2,7.3544433094994893E-2]
["D",4,30,7,"none",60,2,764,101,650,9,4,0.13219895287958114,0.85078534031413611,1.1780104712041885E-2,5.235602094240838E-3]
["D",4,30,7,45,60,2,764,101,584,11,68,0.13219895287958114,0.76439790575916233,1.4397905759162303E-2,8.9005235602094238E-2]
["D",4,30,7,45,40,2,764,101,579,15,68,0.13219895287958114,0.75785340314136129,1.9633507853403141E-2,8.9005235602094238E-2]
["D",4,30,7,45,20,2,764,101,568,25,70,0.13219895287958114,0.74345549738219896,3.2722513089005235E-2,9.1623036649214659E-2]
["D",4,23,20.399999999999999,"none",60,0.5,2021,101,1559,355,6,4.9975259772389903E-2,0.77140029688273137,0.17565561603166749,2.9688273132112814E-3]
["D",4,23,20.399999999999999,45,60,0.5,2021,101,1435,414,71,4.9975259772389903E-2,0.71004453240969811,0.20484908461157841,3.5131123206333499E-2]
["D",4,23,20.399999999999999,45,40,0.5,2021,101,1342,505,72,4.9975259772389903E-2,0.66402770905492325,0.24987629886194954,3.5625927758535375E-2]
["D",4,23,20.399999999999999,45,20,0.5,2021,101,1197,647,75,4.9975259772389903E-2,0.5922810489856507,0.32013854527461655,3.7110341415141017E-2]
["D",4,23,13.6,"none",60,0.75,1383,101,1161,116,5,7.3029645697758494E-2,0.83947939262472882,8.3875632682574114E-2,3.6153289949385392E-3]
["D",4,23,13.6,45,60,0.75,1383,101,1073,139,70,7.3029645697758494E-2,0.7758496023138105,0.1005061460592914,5.061460592913955E-2]
["D",4,23,13.6,45,40,0.75,1383,101,1028,183,71,7.3029645697758494E-2,0.74331164135936367,0.13232104121475055,5.1337671728127261E-2]
["D",4,23,13.6,45,20,0.75,1383,101,952,257,73,7.3029645697758494E-2,0.68835864063629792,0.18582791033984092,5.2783803326102677E-2]
["D",4,23,10.199999999999999,"none",60,1,1064,101,910,48,5,9.492481203007519E-2,0.85526315789473684,4.5112781954887216E-2,4.6992481203007516E-3]
["D",4,23,10.199999999999999,45,60,1,1064,101,835,59,69,9.492481203007519E-2,0.78477443609022557,5.5451127819548869E-2,6.4849624060150379E-2]
["D",4,23,10.199999999999999,45,40,1,1064,101,814,79,70,9.492481203007519E-2,0.76503759398496241,7.4248120300751883E-2,6.5789473684210523E-2]
["D",4,23,10.199999999999999,45,20,1,1064,101,772,119,72,9.492481203007519E-2,0.72556390977443608,0.1118421052631579,6.7669172932330823E-2]
["D",4,23,8.1999999999999993,"none",60,1.25,876,101,748,23,4,0.11529680365296803,0.85388127853881279,2.6255707762557076E-2,4.5662100456621002E-3]
["D",4,23,8.1999999999999993,45,60,1.25,876,101,677,29,68,0.11529680365296803,0.77283105022831056,3.3105022831050226E-2,7.7625570776255703E-2]
["D",4,23,8.1999999999999993,45,40,1.25,876,101,665,40,69,0.11529680365296803,0.7591324200913242,4.5662100456621002E-2,7.8767123287671229E-2]
["D",4,23,8.1999999999999993,45,20,1.25,876,101,641,63,71,0.11529680365296803,0.7317351598173516,7.1917808219178078E-2,8.1050228310502279E-2]
["D",4,23,6.8,"none",60,1.5,745,101,628,13,4,0.13557046979865772,0.84295302013422824,1.74496644295302E-2,5.3691275167785232E-3]
["D",4,23,6.8,45,60,1.5,745,101,560,16,68,0.13557046979865772,0.75167785234899331,2.1476510067114093E-2,9.1275167785234895E-2]
["D",4,23,6.8,45,40,1.5,745,101,554,21,68,0.13557046979865772,0.74362416107382545,2.8187919463087248E-2,9.1275167785234895E-2]
["D",4,23,6.8,45,20,1.5,745,101,539,35,70,0.13557046979865772,0.72348993288590602,4.6979865771812082E-2,9.3959731543624164E-2]
["D",4,23,5.0999999999999996,"none",60,2,585,101,477,4,4,0.17264957264957265,0.81538461538461537,6.8376068376068376E-3,6.8376068376068376E-3]
["D",4,23,5.0999999999999996,45,60,2,585,101,411,7,66,0.17264957264957265,0.70256410256410251,1.1965811965811967E-2,0.11282051282051282]
["D",4,23,5.0999999999999996,45,40,2,585,101,409,9,67,0.17264957264957265,0.6991452991452991,1.5384615384615385E-2,0.11452991452991453]
["D",4,23,5.0999999999999996,45,20,2,585,101,403,13,68,0.17264957264957265,0.68888888888888888,2.2222222222222223E-2,0.11623931623931624]

{"sheet":"D-5ft","index":12,"n_rows":50,"n_cols":16,"rows_kept":50,"cut":false,"hidden":true,"merged":[]}
[null,null,null,null,null,null,null,"Runoff","ET","Drainage","Overflow","Exfiltration"]
["Soil Type","Media Depth","Surf Storage","Area Ratio","Top of IWS","DC","Area Ratio","Rainfall","ET","Drainage","Runoff","VertSeepage","ET","Drainage","Overflow","Exfiltration"]
["D",5,30,28,"none",60,0.5,2734,100,2014,615,5,{"$f":"I3/H3","v":3.6576444769568395E-2},{"$f":"J3/H3","v":0.73664959765910754},{"$f":"K3/H3","v":0.22494513533284566},{"$f":"L3/H3","v":1.8288222384784199E-3}]
["D",5,30,28,45,60,0.5,2734,101,1839,701,93,3.6942209217264085E-2,0.67264081931236286,0.25640087783467447,3.4016093635698609E-2]
["D",5,30,28,45,40,0.5,2734,101,1720,819,94,3.6942209217264085E-2,0.62911485003657641,0.29956108266276515,3.4381858083394293E-2]
["D",5,30,28,45,20,0.5,2734,101,1514,1021,98,3.6942209217264085E-2,0.55376737381126551,0.37344550109729335,3.5844915874177027E-2]
["D",5,30,18.7,"none",60,0.75,1861,100,1542,215,4,5.3734551316496508E-2,0.82858678130037611,0.1155292853304675,2.1493820526598604E-3]
["D",5,30,18.7,45,60,0.75,1861,101,1414,255,92,5.4271896829661471E-2,0.75980655561526056,0.13702310585706609,4.9435787211176786E-2]
["D",5,30,18.7,45,40,0.75,1861,101,1351,316,93,5.4271896829661471E-2,0.72595378828586776,0.16980118216012896,4.997313272434175E-2]
["D",5,30,18.7,45,20,0.75,1861,101,1236,428,96,5.4271896829661471E-2,0.66415905427189681,0.22998387963460504,5.1585169263836647E-2]
["D",5,30,14,"none",60,1,1420,100,1227,90,4,7.0422535211267609E-2,0.86408450704225348,6.3380281690140844E-2,2.8169014084507044E-3]
["D",5,30,14,45,60,1,1420,101,1120,108,91,7.1126760563380284E-2,0.78873239436619713,7.605633802816901E-2,6.4084507042253519E-2]
["D",5,30,14,45,40,1,1420,101,1088,140,92,7.1126760563380284E-2,0.76619718309859153,9.8591549295774641E-2,6.4788732394366194E-2]
["D",5,30,14,45,20,1,1420,101,1021,204,94,7.1126760563380284E-2,0.71901408450704229,0.14366197183098592,6.6197183098591544E-2]
["D",5,30,11.2,"none",60,1.25,1158,100,1011,44,3,8.6355785837651119E-2,0.87305699481865284,3.7996545768566495E-2,2.5906735751295338E-3]
["D",5,30,11.2,45,60,1.25,1158,101,914,53,90,8.7219343696027629E-2,0.78929188255613125,4.5768566493955096E-2,7.7720207253886009E-2]
["D",5,30,11.2,45,40,1.25,1158,101,895,71,91,8.7219343696027629E-2,0.77288428324697755,6.1312607944732297E-2,7.8583765112262519E-2]
["D",5,30,11.2,45,20,1.25,1158,101,856,108,93,8.7219343696027629E-2,0.73920552677029361,9.3264248704663211E-2,8.0310880829015538E-2]
["D",5,30,9.3000000000000007,"none",60,1.5,979,99,854,23,3,0.10112359550561797,0.87231869254341166,2.3493360572012258E-2,3.0643513789581204E-3]
["D",5,30,9.3000000000000007,45,60,1.5,979,101,760,29,89,0.10316649642492338,0.77630234933605724,2.9622063329928498E-2,9.0909090909090912E-2]
["D",5,30,9.3000000000000007,45,40,1.5,979,101,750,39,90,0.10316649642492338,0.76608784473953018,3.9836567926455568E-2,9.193054136874361E-2]
["D",5,30,9.3000000000000007,45,20,1.5,979,101,725,61,92,0.10316649642492338,0.74055158324821246,6.2308478038815118E-2,9.3973442288049033E-2]
["D",5,30,7,"none",60,2,764,99,654,9,3,0.12958115183246074,0.85602094240837701,1.1780104712041885E-2,3.9267015706806281E-3]
["D",5,30,7,45,60,2,764,101,564,11,88,0.13219895287958114,0.73821989528795806,1.4397905759162303E-2,0.11518324607329843]
["D",5,30,7,45,40,2,764,101,559,15,89,0.13219895287958114,0.73167539267015702,1.9633507853403141E-2,0.11649214659685864]
["D",5,30,7,45,20,2,764,101,548,24,90,0.13219895287958114,0.7172774869109948,3.1413612565445025E-2,0.11780104712041885]
["D",5,23,20.399999999999999,"none",60,0.5,2021,100,1565,352,4,4.9480455220188027E-2,0.77436912419594262,0.17417120237506184,1.9792182088075212E-3]
["D",5,23,20.399999999999999,45,60,0.5,2021,101,1417,411,92,4.9975259772389903E-2,0.70113805047006428,0.20336467095497279,4.5522018802572985E-2]
["D",5,23,20.399999999999999,45,40,0.5,2021,101,1326,501,93,4.9975259772389903E-2,0.65611083621969324,0.247897080653142,4.6016823354774861E-2]
["D",5,23,20.399999999999999,45,20,0.5,2021,101,1181,643,96,4.9975259772389903E-2,0.58436417615042058,0.31815932706580902,4.7501237011380502E-2]
["D",5,23,13.6,"none",60,0.75,1383,100,1165,115,4,7.230657989877079E-2,0.84237165582067963,8.315256688358641E-2,2.8922631959508315E-3]
["D",5,23,13.6,45,60,0.75,1383,101,1053,139,90,7.3029645697758494E-2,0.76138828633405642,0.1005061460592914,6.5075921908893705E-2]
["D",5,23,13.6,45,40,0.75,1383,101,1010,180,92,7.3029645697758494E-2,0.73029645697758494,0.13015184381778741,6.6522053506869128E-2]
["D",5,23,13.6,45,20,0.75,1383,101,934,254,94,7.3029645697758494E-2,0.67534345625451919,0.18365871294287781,6.7968185104844536E-2]
["D",5,23,10.199999999999999,"none",60,1,1064,100,914,47,3,9.3984962406015032E-2,0.85902255639097747,4.4172932330827065E-2,2.819548872180451E-3]
["D",5,23,10.199999999999999,45,60,1,1064,101,814,59,89,9.492481203007519E-2,0.76503759398496241,5.5451127819548869E-2,8.3646616541353386E-2]
["D",5,23,10.199999999999999,45,40,1,1064,101,795,78,90,9.492481203007519E-2,0.7471804511278195,7.3308270676691725E-2,8.4586466165413529E-2]
["D",5,23,10.199999999999999,45,20,1,1064,101,753,117,92,9.492481203007519E-2,0.70770676691729328,0.10996240601503759,8.646616541353383E-2]
["D",5,23,8.1999999999999993,"none",60,1.25,876,99,751,23,3,0.11301369863013698,0.85730593607305938,2.6255707762557076E-2,3.4246575342465752E-3]
["D",5,23,8.1999999999999993,45,60,1.25,876,101,658,29,89,0.11529680365296803,0.75114155251141557,3.3105022831050226E-2,0.10159817351598173]
["D",5,23,8.1999999999999993,45,40,1.25,876,101,646,40,89,0.11529680365296803,0.73744292237442921,4.5662100456621002E-2,0.10159817351598173]
["D",5,23,8.1999999999999993,45,20,1.25,876,101,623,61,91,0.11529680365296803,0.71118721461187218,6.9634703196347028E-2,0.10388127853881278]
["D",5,23,6.8,"none",60,1.5,745,99,631,12,3,0.13288590604026845,0.84697986577181206,1.6107382550335572E-2,4.0268456375838931E-3]
["D",5,23,6.8,45,60,1.5,745,101,540,16,88,0.13557046979865772,0.72483221476510062,2.1476510067114093E-2,0.11812080536912752]
["D",5,23,6.8,45,40,1.5,745,101,534,21,88,0.13557046979865772,0.71677852348993287,2.8187919463087248E-2,0.11812080536912752]
["D",5,23,6.8,45,20,1.5,745,101,519,35,90,0.13557046979865772,0.69664429530201344,4.6979865771812082E-2,0.12080536912751678]
["D",5,23,5.0999999999999996,"none",60,2,585,99,480,4,2,0.16923076923076924,0.82051282051282048,6.8376068376068376E-3,3.4188034188034188E-3]
["D",5,23,5.0999999999999996,45,60,2,585,101,392,7,86,0.17264957264957265,0.67008547008547004,1.1965811965811967E-2,0.14700854700854701]
["D",5,23,5.0999999999999996,45,40,2,585,101,390,8,87,0.17264957264957265,0.66666666666666663,1.3675213675213675E-2,0.14871794871794872]
["D",5,23,5.0999999999999996,45,20,2,585,101,384,13,88,0.17264957264957265,0.65641025641025641,2.2222222222222223E-2,0.15042735042735042]